{"text_format":"1","workbook":"xlsx","n_sheets":8,"sheets":["Fitness Space Calcs","size classes","Components and Space Standards","Army","Navy","AF","MC","Interactive Worksheet"],"not_rendered":{"charts":0,"images":0,"macros":1,"external_links":0,"defined_names":13,"comments":6,"pivot_tables":0},"unopened":[],"bounds":{"document_bytes":16777216,"sheet_cells":100000,"rows_first":2000,"rows_last":500,"rows_between":2000,"halvings":0,"cell_chars":16384,"cell_head_chars":4096},"cells_cut":0,"cells_raw":0,"read":"whole","date_system":"1900"}

{"sheet":"Fitness Space Calcs","index":0,"n_rows":26,"n_cols":7,"rows_kept":26,"cut":false,"hidden":true,"merged":[[0,0,0,5],[14,0,14,5]]}
["small/extra small"]
[null,"Navy (.5k)","Army (1k)","MC (.5k)","AF (1k)"]
["stretch",100,100,100,{"$f":"4*F3","v":200},50,"(min 2 ppl + 1 person/every 50 users)"]
["cardio",{"$f":"10*F4","v":500},{"$f":"11*F4","v":550},{"$f":"8*F4","v":400},{"$f":"50*F4","v":2500},50]
["select",{"$f":"15*F5","v":750},{"$f":"16*F5","v":800},{"$f":"(6*0.5)*F5","v":150},{"$f":"38*F5","v":1900},50]
["free",{"$f":"12*F6","v":780},{"$f":"15*F6","v":975},{"$f":"(6*0.5)*F6","v":195},{"$f":"32*F6","v":2080},65]
[]
[null,{"$f":"SUM(B3:B7)","v":2130},{"$f":"SUM(C3:C7)","v":2425},{"$f":"SUM(D3:D7)","v":845},{"$f":"SUM(E3:E7)","v":6680},null,{"$f":"0.25*E8","v":1670}]
[]
["current",1000,2325,1000,6900]
[]
[null,"37 ppl","42 ppl","14 ppl","120 ppl"]
[]
[]
["medium"]
[null,"Navy (3-7k)","Army (3-6k)","MC (3-7k)","AF (1-5k)"]
["stretch",{"$f":"3*F17","v":150},{"$f":"5*F17","v":250},{"$f":"5*F17","v":250},{"$f":"5*F17","v":250},50]
["cardio",{"$f":"30*F18","v":1500},{"$f":"51*F18","v":2550},{"$f":"75*F18","v":3750},{"$f":"65*F18","v":3250},50]
["select",{"$f":"15*F19","v":750},{"$f":"30*F19","v":1500},{"$f":"(60*0.5)*F19","v":1500},{"$f":"47*F19","v":2350},50]
["free",{"$f":"24*F20","v":1560},{"$f":"50*F20","v":3250},{"$f":"(60*0.5)*F20","v":1950},{"$f":"35*F20","v":2275},65]
[]
[null,{"$f":"SUM(B17:B21)","v":3960},{"$f":"SUM(C17:C21)","v":7550},{"$f":"SUM(D17:D21)","v":7450},{"$f":"SUM(E17:E21)","v":8125}]
[]
["current",2500,7300,6750,6900]
[]
[null,"67 ppl","131 ppl","135 ppl","147 ppl"]

{"sheet":"size classes","index":1,"n_rows":31,"n_cols":5,"rows_kept":31,"cut":false,"hidden":true,"merged":[]}
["Army",null,"Populations",null,"Spreadsheet (2nd tab)"]
["ex small",null,"251-1,000"]
["small",null,"1,001-3,000"]
["medium",null,"3,001-6,000"]
["large",null,"6,001-10,000"]
["ex large",null,"10,001-15,000"]
["+5000"]
[]
["Navy",null,null,null,"Stds Metrics (equip counts)"]
["ex small",null,"<500"]
["small",null,"501-3,000"]
["medium",null,"3,001-7,000"]
["large",null,"7,001-14,000"]
["ex large",null,"14,001-30,000"]
["jumbo",null,">30,000"]
[]
["AF",null,null,null,"Design guide"]
["small",null,"<1,000"]
["medium",null,"1,001-5,000"]
["large",null,"5,001-6,000"]
["+1000"]
[]
[]
["MC *",null,null,null,"P-80 and MC formula"]
["ex small",null,"<500"]
["small",null,"501-3,000"]
["medium",null,"3,001-7,000"]
["large",null,"7,001-14,000"]
["ex large",null,"14,001-30,000"]
["jumbo",null,">30,000"]
["* fitness area sized on actual population"]

{"sheet":"Components and Space Standards","index":2,"n_rows":102,"n_cols":8,"rows_kept":102,"cut":false,"hidden":true,"merged":[[69,5,70,5],[0,5,1,5],[0,1,0,4],[53,0,53,4],[64,0,64,4],[2,0,2,4],[22,5,27,5],[12,5,15,5],[35,5,36,5],[49,5,50,5]]}
[9.2899999999999996E-2,"Space Allocation Standard",null,null,null,"Notes"]
["Functional Component","m2","ft.2","Standard","Description"]
["Fitness Spaces"]
["Lobby/Reception"]
["Entry Lobby",{"$f":"$A$1*C5","v":9.2899999999999991},100,"Vestibule/Lobby Module(s) (for 2-3 ppl)","Vesibule and/or space for 2 to 3 ppl to queue","between bldg entrance and control"]
["Control Counter",11.612499999999999,125,"Counter Module(s)","Space for counter, space behind, space in front","Includes minor retail items"]
["Equipment issue storage",16.2575,175,"Storage Module(s)","Equipment storage at/behind gear issue ","2 units min. for Navy. Others get 1 unit in smallest"]
["Vending",1.8579999999999999,20,"Vending Machine(s)","per vending machine","2 for small"]
["Waiting/Display",8.3609999999999989,90,"Seating/Display Module(s) (for 4 ppl)","Space for seating for 4 ppl and display area","Waiting area adjacent to lobby and in front of control. Grows in units of 90"]
["Spectator peak-time circulation",27.869999999999997,{"$f":"(3*200)*0.5","v":300},"Circulation Module(s)","Per one-side bleachers - driven by gym size","Optional, 300 sf for 1 set bleachers, Additional circulation space for peak gym loads"]
["Public restrooms/phones",0,null,"Public Restroom(s)","Option - Driven by gym size","1 (uni), 1/1, ?/?, 4/6 (limit option to those below the facility size) Largest gym size drives largest bathroom. AF limited to top three options."]
["Gymnasium"]
["Basketball/volleyball Court",826.06679999999994,{"$f":"(10+94+10)*(10+50+10+8)","v":8892},"One-court/200-seat Module(s)","NCAA Court + 10' safety + 200 seats (one side)","Need both elements if indoor track is required."]
["Two Court Module",{"$f":"$A$1*C14","v":1630.9523999999999},17556,"Two-court/200-seat Module(s)","Two courts + 10' safety, 16' between cts, + 200 seats"]
["Arena-style Two-Court Module",{"$f":"$A$1*C15","v":1708.6168},18392,"Arena-style Two-Court Module(s)","Provides space for arena-style seating for center, longitudinal ct."]
["Additional Spectator seating",84.706219999999988,{"$f":"(8+1.7)*94","v":911.8},"Additional 200-seat Module(s)","Four rows of seats (one ea. side) = 200 ppl."]
["Basic storage/support",65.03,700,"Storage Module(s)","Roughly 8% of base gym area"]
["Additional court storage",32.515000000000001,350,"Additional storage module(s)","Storage space per additional court"]
["Unit PT/Group Exercise"]
["Partitionable Room(s)",4.6449999999999996,{"$f":"50","v":50},"people at 4.6 m2 (50 ft.2)/person","116.1 m2 (1,250 ft.2) (25 ppl) minimum size","1250 = min. Navy, AF, MC / 2500 = min Army"]
["Storage/support",0.46449999999999997,{"$f":"C20*0.1","v":5},"10% of partitionable room area","11.6 m2 (125 ft.2) minimum (10% of room area)"]
["Fitness Spaces"]
["Stretching",4.6449999999999996,50,"people at 4.6 m2 (50 ft.2)/person","50 sf per person - min. 2 ppl","See Fitness Space sheet and exist. docs for these numbers"]
["Cardiovascular Equipment",4.6449999999999996,50,"items at 4.6 m2 (50 ft.2)/item","50 sf per station"]
["Selectorized (machine) weights",4.6449999999999996,50,"items at 4.6 m2 (50 ft.2)/item","50 sf per station"]
["Free/Plate-loaded weights",6.0385,65,"stations at 6.0 m2 (65 ft.2)/stations","65 sf per station"]
["Finess Program Manager's Office",11.612499999999999,125,"Office","Private office that may include fitness testing equipment"]
["Fitness Assessment Room",11.612499999999999,125,"Office(s)","1 piece fitness equip for testing, computer desk, chairs, stretching"]
["Structured Activities"]
["Structured Activity Space",74.319999999999993,800,"Flexible space Module(s)","Based on size of a single racquetball court","equip. based"]
["Racquetball Courts",74.319999999999993,800,"Racquetball Court(s)","Single court size. Minimum of two courts"]
["Auxiliary Gym (MC-only)",{"$f":"$A$1*C32","v":826.06679999999994},{"$f":"(10+94+10)*(10+50+10+8)","v":8892},"One-court/200-seat Module(s)","NCAA Court + 10' safety + 200 seats (one side)","MC-only"]
["HITT Center (MC-only)",{"$f":"$A$1*C33","v":185.79999999999998},2000,"2000 or 4000 ft2",null,"MC-only"]
["Spectator/officiating (MC Option)",18.579999999999998,{"$f":"(5*20)+(5*20)","v":200},"Spectator/officiating Module(s)","Two rows of 10 seats for one ct. Max of two cts (400 sf)"]
["Structured activity storage",7.4319999999999995,{"$f":"C30*0.1","v":80},"10% of Structured Activity Space","Based on Structured activity space (10% of room area)"]
["Locker Rooms",null,null,null,null,"Apply male/female split on occupant load, then calculate individual male and female locker areas from the split number."]
["Men's Locker Room"]
["Locker/changing area",0.74319999999999997,8,"Lockers","Per slot (2 double lockers or 1 single locker)","Ratios: 1 to 1 (all full), 66% (1 full per 2 dbls -  or 3 ppl / 2 slots), 50% (all double lockers) "]
["Shower/drying area",2.7869999999999999,{"$f":"((2+3+3)*3.5)+2","v":30},"Showers","Per shower & integral drying area at 22 lockers/shower"]
["Toilet area",4.1804999999999994,45,"Water closets/lavatory modules","Per wc and lav. at 30 lockers per wc/lav","Will confirm that 30 lockers per wc/lav is the correct formula"]
["Women's Locker Room"]
["Locker/changing area",0.74319999999999997,8,"Lockers","Per slot (2 double lockers or 1 single locker)"]
["Shower/drying area",2.7869999999999999,{"$f":"((2+3+3)*3.5)+2","v":30},"Showers","Per shower & integral drying area at 22 lockers/shower"]
["Toilet area",4.1804999999999994,45,"Water closets/lavatory modules","per wc and lav. at 20 lockers per wc/lav","Will confirm that 20 lockers per wc/lav is the correct formula"]
["Sauna, cool-down area",null,null,"M/F (2) Saunas/cool-down area","small = 6 ppl, med = 8-9, lg = 12 ppl (+ cool down space)"]
["Steam Room, cool-down area",null,null,"M/F (2) Steam Rooms/cool-down area","small = 6-7 ppl, med = 8-9, lg = 12-14 (+ cool down space)"]
["Hot Tub",null,null,"Unisex Hot Tub","small = 5 ppl, med = 8, lg = 12-14 ppl"]
["Support Areas"]
["Laundry",18.579999999999998,200,"Laundry Room","Per one-washer/two-dryer room","One washer, two dryers, commercial equip, folding table, sink, storage shelves, laundry carts, and opt. ice machine."]
["Equipment repair and receiving",null,null,"Repair/receiving Room","Fixed receiving area + variable repair (10% of Fitness)","10% of total Fitness (Army) / 250 sf (AF) (=(15*10)+(0.1*fitness))\n=(0.05*fitness)"]
["Storage",null,null,"Storage Room","Variable lockable storage room (5% of fitness)"]
["Additional Programmatic Storage",null,null," sf  Additional Storage","To be filled-in by programmer and justified based on item stored."]
["Janitor's Closet(s)",{"$f":"$A$1*C53","v":3.7159999999999997},40,"40 SF/closet","Per Janitor's Closet","2 for X small & small, 3 for Medium, and 4 for Lg X Lg & Jumbo"]
["Health Promotion Spaces - Marine Corps Only (Required or Optional)"]
["Lobby/Reception",{"$f":"$A$1*C55","v":27.869999999999997},300,"Lobby/Reception Module(s)","per area","From AF"]
["Director's Office",11.148,120,"Office","per office","AF office area = 400 sf total"]
["Program Managers' Offices",9.2899999999999991,100,"Office(s)","per office"]
["Support Staff Workstations",5.9455999999999998,64,"Workstation(s)","per workstation"]
["Classrooms/Training rooms",58.527000000000001,630,"Classroom/Training Module(s)","per room","From AF"]
["Resource Room/Computer Lab",23.224999999999998,250,"Resource/Computer Lab Module(s)","per room","From AF - combines comp lab with resource library"]
["Storage/support",7.4319999999999995,80,"Storage/support Module(s)","per area"]
["Demonstration Kitchen (MC-only)",46.449999999999996,500,"Kitchen Module(s)","per kitchen","From AF"]
["Ergometry and Fitness Testing *",7.4319999999999995,80,"Testing Cubicle(s)","per testing cubicles","From AF - cubicles go in an enclosed room (need circulation beteen cubicles--doesn't seem to be accounted for in AF criteria?)"]
["Wellness Assessment *",13.934999999999999,150,"Assessment Room(s)","per room","From AF"]
["Administrative Spaces (required or optional)"]
["Director's Office",{"$f":"$A$1*C66","v":11.148},120,"Office","per office","req."]
["Program Managers' Offices",9.2899999999999991,100,"Office(s)","per office","optional (req. AF)"]
["Support Staff Workstations",5.9455999999999998,64,"Workstation(s)","per office","optional (req. AF)"]
["Copy/file/work/break Room",7.4319999999999995,80,"Workroom Module(s)","per room","req."]
["Classroom/Training Room",69.674999999999997,{"$f":"30*25","v":750},"25-person Module at 750 SF","1,500 SF Med/Lge & 2,250 SF for Xtra Lge/Jumbo","Req. Program space"]
["Classroom/Training Storage",5.5739999999999998,60,"Storage Module(s)","per 25-person Training Room"]
["Optional or Service-specific Program Spaces"]
["* Service-specific space."]
["1 If contract service, verify area with contractor. "]
["Indoor Track"]
["Indoor Track",null,null,"need to include corners"]
["1/14th-mile Indoor Track",{"$f":"$A$1*C77","v":310.00729999999999},3337,"1/14th-mile, 2-lane Indoor Track ",{"$f":"\"1/14th-mile, 2-lane Indoor Track (\"&H77&\" linear ft.)\"","v":"1/14th-mile, 2-lane Indoor Track (754 linear ft.)"},"(smallest gym option, Army and Navy only)",null,{"$f":"ROUND(0.07143*5280*2,0)","v":754}]
["1/12th-mile Indoor Track",523.02699999999993,5630,"1/12th-mile, 3-lane Indoor Track","1/12th-mile, 3-lane Indoor Track (1284 linear ft.)",null,null,{"$f":"ROUND(0.081*5280*3,0)+1","v":1284}]
["1/11th-mile Indoor Track",{"$f":"$A$1*C79","v":556.74969999999996},5993,"1/11th-mile, 3-lane Indoor Track ",{"$f":"\"1/11th-mile, 3-lane Indoor Track (\"&H79&\" linear ft.)\"","v":"1/11th-mile, 3-lane Indoor Track (1440 linear ft.)"},null,null,{"$f":"ROUND(0.09091*5280*3,0)","v":1440}]
["1/8th-mile Indoor Track",989.10629999999992,10647,"1/8th-mile, 4-lane Indoor Track ",{"$f":"\"1/8th-mile, 4-lane Indoor Track (\"&H80&\" linear ft.)\"","v":"1/8th-mile, 4-lane Indoor Track (2640 linear ft.)"},null,null,{"$f":"ROUND(0.125*5280*4,0)","v":2640}]
["Indoor track lobby",13.377599999999999,{"$f":"8*18","v":144},"Indoor track lobby(ies)","Access point to lobby from stair/elevator"]
["Additional Group Exercise Room",116.125,{"$f":"25*50","v":1250},{"$f":"A82","v":"Additional Group Exercise Room"},"per room","Optional catch-up space"]
["Massage Room",11.148,120,"Massage Room(s)","per room"]
["Physical Therapy Training",11.612499999999999,125,"Physical Therapy Training Room(s)","per room","similar to fitness assement"]
["Expanded Retail 1",9.2899999999999991,100,"Expanded Retail Module(s)","per area","dry good, sports equip, clothes, etc. Usually contractor and sep from control"]
["Expanded Juice Bar 1",13.934999999999999,150,"Expanded Juice Bar Module(s)","per area","Additional food/beverage counter. Usually contractor and sep from control"]
["Expanded Juice Bar Seating",13.934999999999999,150,"Two-table seating Module(s)","Two 4-top tables and seating area"]
["Family Changing Room",10.218999999999999,110,"Family Changing Room(s)","per shower, wc, lav, changing, and locker","Indiv. locker area for parent & child (grows by adding showers and changing stalls plus lockers)"]
["Convertible Locker Space",69.674999999999997,750,"Add'l male or female space","750 sf","Optional MC-only space.  Large and larger facilities only"]
["Female DV Locker Room *",23.224999999999998,250,"Female DV Locker Room","250, 500, 750"]
["Child Play Area/Parent Child Area *",74.319999999999993,800,"Parent/child Module(s)","400 sf play area (at 35 sf/child), 400 sf equip (50 sf/equip)","Also 1200, 1600 (all kinds equip)"]
["HAWC Demonstration Kitchen",46.449999999999996,500,"Kitchen Module(s)","per kitchen","From AF"]
["HAWC Relaxation Room *",9.2899999999999991,100,"Relaxation Room(s)","per room","From AF"]
["Site Spaces"]
["Staff Parking",{"$f":"$A$1*C95","v":41.805},450,"Parking Spaces","per space (including circulation)"]
["Loading dock",8.3609999999999989,{"$f":"(18*5)","v":90},"Loading Dock","Per single-truck dock"]
["Service Drive/trash",69.674999999999997,750,"Service Drive Module","per area"]
["Customer Parking",41.805,450,"Parking Spaces","per space (including circulation)"]
["Bicycle Rack Area",14.863999999999999,160,"10-bike Rack(s)","per 10-bike Rack"]
["Patio",2.3224999999999998,25,"Patio Module(s)","per patio"]
["* Service-specific space."]
["1 If contract service, verify area with contractor. "]

{"sheet":"Army","index":3,"n_rows":96,"n_cols":24,"rows_kept":96,"cut":false,"hidden":true,"merged":[[0,20,0,22],[0,23,1,23],[0,17,0,19],[0,5,0,7],[0,1,0,4],[0,8,0,10],[0,11,0,13],[0,14,0,16],[67,0,67,4],[50,0,50,4],[2,0,2,4],[60,0,60,4],[82,23,83,23],[22,23,27,23],[12,23,15,23],[33,23,34,23],[47,23,48,23],[65,23,66,23]]}
["Col. A - D refer to \"Components & Space Standards\" Sheet.","Space Allocation Standard",null,null,null,"Extra Small",null,null,"Small",null,null,"Medium",null,null,"Large",null,null,"Extra Large",null,null,"Army Increment for each add'l 5000",null,null,"Notes"]
["Functional Component","m2","ft.2","Standard","Description","No.","m2","ft.2","No.","m2","ft.2","No.","m2","ft.2","No.","m2","ft.2","No.","m2","ft.2","No.","m2","ft.2"]
[{"$f":"'Components and Space Standards'!A3:E3","v":"Fitness Spaces"}]
[{"$f":"'Components and Space Standards'!A4:E4","v":"Lobby/Reception"}]
[{"$f":"'Components and Space Standards'!A5:E5","v":"Entry Lobby"},{"$f":"'Components and Space Standards'!B5:F5","v":9.2899999999999991},{"$f":"'Components and Space Standards'!C5:G5","v":100},{"$f":"'Components and Space Standards'!D5:G5","v":"Vestibule/Lobby Module(s) (for 2-3 ppl)"},{"$f":"'Components and Space Standards'!E5:H5","v":"Vesibule and/or space for 2 to 3 ppl to queue"},1,{"$f":"$B5*F5","v":9.2899999999999991},{"$f":"F5*$C5","v":100},2,{"$f":"$B5*I5","v":18.579999999999998},{"$f":"I5*$C5","v":200},3,{"$f":"$B5*L5","v":27.869999999999997},{"$f":"L5*$C5","v":300},4,{"$f":"$B5*O5","v":37.159999999999997},{"$f":"O5*$C5","v":400},5,{"$f":"$B5*R5","v":46.449999999999996},{"$f":"R5*$C5","v":500},1,{"$f":"$B5*U5","v":9.2899999999999991},{"$f":"U5*$C5","v":100},"between bldg entrance and control"]
[{"$f":"'Components and Space Standards'!A6:E6","v":"Control Counter"},{"$f":"'Components and Space Standards'!B6:F6","v":11.612499999999999},{"$f":"'Components and Space Standards'!C6:G6","v":125},{"$f":"'Components and Space Standards'!D6:G6","v":"Counter Module(s)"},{"$f":"'Components and Space Standards'!E6:H6","v":"Space for counter, space behind, space in front"},1,{"$f":"$B6*F6","v":11.612499999999999},{"$f":"F6*$C6","v":125},2,{"$f":"$B6*I6","v":23.224999999999998},{"$f":"I6*$C6","v":250},3,{"$f":"$B6*L6","v":34.837499999999999},{"$f":"L6*$C6","v":375},4,{"$f":"$B6*O6","v":46.449999999999996},{"$f":"O6*$C6","v":500},5,{"$f":"$B6*R6","v":58.062499999999993},{"$f":"R6*$C6","v":625},1,11.612499999999999,125,"Includes minor retail items"]
[{"$f":"'Components and Space Standards'!A7:E7","v":"Equipment issue storage"},{"$f":"'Components and Space Standards'!B7:F7","v":16.2575},{"$f":"'Components and Space Standards'!C7:G7","v":175},{"$f":"'Components and Space Standards'!D7:G7","v":"Storage Module(s)"},{"$f":"'Components and Space Standards'!E7:H7","v":"Equipment storage at/behind gear issue "},1,{"$f":"$B7*F7","v":16.2575},{"$f":"F7*$C7","v":175},2,{"$f":"$B7*I7","v":32.515000000000001},{"$f":"I7*$C7","v":350},3,{"$f":"$B7*L7","v":48.772500000000001},{"$f":"L7*$C7","v":525},4,{"$f":"$B7*O7","v":65.03},{"$f":"O7*$C7","v":700},5,{"$f":"$B7*R7","v":81.287499999999994},{"$f":"R7*$C7","v":875},1,16.2575,175,"2 units min. for Navy. Others get 1 unit in smallest"]
[{"$f":"'Components and Space Standards'!A8:E8","v":"Vending"},{"$f":"'Components and Space Standards'!B8:F8","v":1.8579999999999999},{"$f":"'Components and Space Standards'!C8:G8","v":20},{"$f":"'Components and Space Standards'!D8:G8","v":"Vending Machine(s)"},{"$f":"'Components and Space Standards'!E8:H8","v":"per vending machine"},2,{"$f":"$B8*F8","v":3.7159999999999997},{"$f":"F8*$C8","v":40},3,{"$f":"$B8*I8","v":5.5739999999999998},{"$f":"I8*$C8","v":60},4,{"$f":"$B8*L8","v":7.4319999999999995},{"$f":"L8*$C8","v":80},6,{"$f":"$B8*O8","v":11.148},{"$f":"O8*$C8","v":120},7,{"$f":"$B8*R8","v":13.005999999999998},{"$f":"R8*$C8","v":140},1,1.8579999999999999,20,"2 for small"]
[{"$f":"'Components and Space Standards'!A9:E9","v":"Waiting/Display"},{"$f":"'Components and Space Standards'!B9:F9","v":8.3609999999999989},{"$f":"'Components and Space Standards'!C9:G9","v":90},{"$f":"'Components and Space Standards'!D9:G9","v":"Seating/Display Module(s) (for 4 ppl)"},{"$f":"'Components and Space Standards'!E9:H9","v":"Space for seating for 4 ppl and display area"},1,{"$f":"$B9*F9","v":8.3609999999999989},{"$f":"F9*$C9","v":90},2,{"$f":"$B9*I9","v":16.721999999999998},{"$f":"I9*$C9","v":180},4,{"$f":"$B9*L9","v":33.443999999999996},{"$f":"L9*$C9","v":360},6,{"$f":"$B9*O9","v":50.165999999999997},{"$f":"O9*$C9","v":540},7,{"$f":"$B9*R9","v":58.526999999999994},{"$f":"R9*$C9","v":630},1,8.3609999999999989,90,"Waiting area adjacent to lobby and in front of control. Grows in units of 90"]
[{"$f":"'Components and Space Standards'!A10:E10","v":"Spectator peak-time circulation"},{"$f":"'Components and Space Standards'!B10:F10","v":27.869999999999997},{"$f":"'Components and Space Standards'!C10:G10","v":300},{"$f":"'Components and Space Standards'!D10:G10","v":"Circulation Module(s)"},{"$f":"'Components and Space Standards'!E10:H10","v":"Per one-side bleachers - driven by gym size"},null,null,null,null,null,null,null,null,null,null,null,null,null,null,null,0,0,0,"Optional, 300 sf for 1 set bleachers, Additional circulation space for peak gym loads"]
[{"$f":"'Components and Space Standards'!A11:E11","v":"Public restrooms/phones"},{"$f":"'Components and Space Standards'!B11:F11","v":0},{"$f":"'Components and Space Standards'!C11:G11","v":0},{"$f":"'Components and Space Standards'!D11:G11","v":"Public Restroom(s)"},{"$f":"'Components and Space Standards'!E11:H11","v":"Option - Driven by gym size"},null,null,null,null,null,null,null,null,null,null,null,null,null,null,null,null,null,null,"1 (uni), 1/1, ?/?, 4/6 (limit option to those below the facility size) Largest gym size drives largest bathroom. AF limited to top three options."]
[{"$f":"'Components and Space Standards'!A12:E12","v":"Gymnasium"}]
[{"$f":"'Components and Space Standards'!A13:E13","v":"Basketball/volleyball Court"},{"$f":"'Components and Space Standards'!B13:F13","v":826.06679999999994},{"$f":"'Components and Space Standards'!C13:G13","v":8892},{"$f":"'Components and Space Standards'!D13:G13","v":"One-court/200-seat Module(s)"},{"$f":"'Components and Space Standards'!E13:H13","v":"NCAA Court + 10' safety + 200 seats (one side)"},1,{"$f":"$B13*F13","v":826.06679999999994},{"$f":"F13*$C13","v":8892},null,{"$f":"$B13*I13","v":0},{"$f":"I13*$C13","v":0},1,{"$f":"$B13*L13","v":826.06679999999994},{"$f":"L13*$C13","v":8892},null,{"$f":"$B13*O13","v":0},{"$f":"O13*$C13","v":0},1,{"$f":"$B13*R13","v":826.06679999999994},{"$f":"R13*$C13","v":8892},1,{"$f":"$B13*U13","v":826.06679999999994},{"$f":"U13*$C13","v":8892},"Need both elements if indoor track is required."]
[{"$f":"'Components and Space Standards'!A14:E14","v":"Two Court Module"},{"$f":"'Components and Space Standards'!B14:F14","v":1630.9523999999999},{"$f":"'Components and Space Standards'!C14:G14","v":17556},{"$f":"'Components and Space Standards'!D14:G14","v":"Two-court/200-seat Module(s)"},{"$f":"'Components and Space Standards'!E14:H14","v":"Two courts + 10' safety, 16' between cts, + 200 seats"},null,0,0,null,0,0,null,0,0,1,1630.9523999999999,17556,1,1630.9523999999999,17556,null,0,0]
[{"$f":"'Components and Space Standards'!A15:E15","v":"Arena-style Two-Court Module"},{"$f":"'Components and Space Standards'!B15:F15","v":1708.6168},{"$f":"'Components and Space Standards'!C15:G15","v":18392},{"$f":"'Components and Space Standards'!D15:G15","v":"Arena-style Two-Court Module(s)"},{"$f":"'Components and Space Standards'!E15:H15","v":"Provides space for arena-style seating for center, longitudinal ct."},null,0,0,1,1708.6168,18392,1,1708.6168,18392,1,1708.6168,18392,1,1708.6168,18392,null,0,0]
[{"$f":"'Components and Space Standards'!A16:E16","v":"Additional Spectator seating"},{"$f":"'Components and Space Standards'!B16:F16","v":84.706219999999988},{"$f":"'Components and Space Standards'!C16:G16","v":911.8},{"$f":"'Components and Space Standards'!D16:G16","v":"Additional 200-seat Module(s)"},{"$f":"'Components and Space Standards'!E16:H16","v":"Four rows of seats (one ea. side) = 200 ppl."},1,84.706219999999988,911.8,null,0,0,null,0,0,null,0,0,null,0,0,null,0,0]
[{"$f":"'Components and Space Standards'!A17:E17","v":"Basic storage/support"},{"$f":"'Components and Space Standards'!B17:F17","v":65.03},{"$f":"'Components and Space Standards'!C17:G17","v":700},{"$f":"'Components and Space Standards'!D17:G17","v":"Storage Module(s)"},{"$f":"'Components and Space Standards'!E17:H17","v":"Roughly 8% of base gym area"},1,65.03,700,1,65.03,700,1,65.03,700,1,65.03,700,1,65.03,700,null,0,0]
[{"$f":"'Components and Space Standards'!A18:E18","v":"Additional court storage"},{"$f":"'Components and Space Standards'!B18:F18","v":32.515000000000001},{"$f":"'Components and Space Standards'!C18:G18","v":350},{"$f":"'Components and Space Standards'!D18:G18","v":"Additional storage module(s)"},{"$f":"'Components and Space Standards'!E18:H18","v":"Storage space per additional court"},null,0,0,1,32.515000000000001,350,2,65.03,700,2,65.03,700,3,97.545000000000002,1050,1,32.515000000000001,350]
[{"$f":"'Components and Space Standards'!A19:E19","v":"Unit PT/Group Exercise"}]
[{"$f":"'Components and Space Standards'!A20:E20","v":"Partitionable Room(s)"},{"$f":"'Components and Space Standards'!B20:F20","v":4.6449999999999996},{"$f":"'Components and Space Standards'!C20:G20","v":50},{"$f":"'Components and Space Standards'!D20:G20","v":"people at 4.6 m2 (50 ft.2)/person"},{"$f":"'Components and Space Standards'!E20:H20","v":"116.1 m2 (1,250 ft.2) (25 ppl) minimum size"},44,{"$f":"$B20*F20","v":204.38},{"$f":"F20*$C20","v":2200},58,{"$f":"$B20*I20","v":269.40999999999997},{"$f":"I20*$C20","v":2900},91,{"$f":"$B20*L20","v":422.69499999999994},{"$f":"L20*$C20","v":4550},140,{"$f":"$B20*O20","v":650.29999999999995},{"$f":"O20*$C20","v":7000},210,{"$f":"$B20*R20","v":975.44999999999993},{"$f":"R20*$C20","v":10500},70,{"$f":"$B20*U20","v":325.14999999999998},{"$f":"U20*$C20","v":3500},"1250 = min. Navy, AF, MC / 2500 = min Army"]
[{"$f":"'Components and Space Standards'!A21:E21","v":"Storage/support"},{"$f":"'Components and Space Standards'!B21:F21","v":0.46449999999999997},{"$f":"'Components and Space Standards'!C21:G21","v":5},{"$f":"'Components and Space Standards'!D21:G21","v":"10% of partitionable room area"},{"$f":"'Components and Space Standards'!E21:H21","v":"11.6 m2 (125 ft.2) minimum (10% of room area)"},44,{"$f":"$B21*F21","v":20.437999999999999},{"$f":"F21*$C21","v":220},58,{"$f":"$B21*I21","v":26.940999999999999},{"$f":"I21*$C21","v":290},91,{"$f":"$B21*L21","v":42.269499999999994},{"$f":"L21*$C21","v":455},140,{"$f":"$B21*O21","v":65.03},{"$f":"O21*$C21","v":700},210,{"$f":"$B21*R21","v":97.544999999999987},{"$f":"R21*$C21","v":1050},70,{"$f":"$B21*U21","v":32.515000000000001},{"$f":"U21*$C21","v":350}]
[{"$f":"'Components and Space Standards'!A22:E22","v":"Fitness Spaces"}]
[{"$f":"'Components and Space Standards'!A23:E23","v":"Stretching"},{"$f":"'Components and Space Standards'!B23:F23","v":4.6449999999999996},{"$f":"'Components and Space Standards'!C23:G23","v":50},{"$f":"'Components and Space Standards'!D23:G23","v":"people at 4.6 m2 (50 ft.2)/person"},{"$f":"'Components and Space Standards'!E23:H23","v":"50 sf per person - min. 2 ppl"},2,{"$f":"$B23*F23","v":9.2899999999999991},{"$f":"F23*$C23","v":100},3,{"$f":"$B23*I23","v":13.934999999999999},{"$f":"I23*$C23","v":150},4,{"$f":"$B23*L23","v":18.579999999999998},{"$f":"L23*$C23","v":200},5,{"$f":"$B23*O23","v":23.224999999999998},{"$f":"O23*$C23","v":250},6,{"$f":"$B23*R23","v":27.869999999999997},{"$f":"R23*$C23","v":300},1,{"$f":"$B23*U23","v":4.6449999999999996},{"$f":"U23*$C23","v":50},"See Fitness Space sheet and exist. docs for these numbers"]
[{"$f":"'Components and Space Standards'!A24:E24","v":"Cardiovascular Equipment"},{"$f":"'Components and Space Standards'!B24:F24","v":4.6449999999999996},{"$f":"'Components and Space Standards'!C24:G24","v":50},{"$f":"'Components and Space Standards'!D24:G24","v":"items at 4.6 m2 (50 ft.2)/item"},{"$f":"'Components and Space Standards'!E24:H24","v":"50 sf per station"},11,51.094999999999999,550,27,125.41499999999999,1350,51,236.89499999999998,2550,80,371.59999999999997,4000,120,557.4,6000,40,185.79999999999998,2000]
[{"$f":"'Components and Space Standards'!A25:E25","v":"Selectorized (machine) weights"},{"$f":"'Components and Space Standards'!B25:F25","v":4.6449999999999996},{"$f":"'Components and Space Standards'!C25:G25","v":50},{"$f":"'Components and Space Standards'!D25:G25","v":"items at 4.6 m2 (50 ft.2)/item"},{"$f":"'Components and Space Standards'!E25:H25","v":"50 sf per station"},16,74.319999999999993,800,27,125.41499999999999,1350,33,153.285,1650,46,213.67,2300,66,306.57,3300,20,92.899999999999991,1000]
[{"$f":"'Components and Space Standards'!A26:E26","v":"Free/Plate-loaded weights"},{"$f":"'Components and Space Standards'!B26:F26","v":6.0385},{"$f":"'Components and Space Standards'!C26:G26","v":65},{"$f":"'Components and Space Standards'!D26:G26","v":"stations at 6.0 m2 (65 ft.2)/stations"},{"$f":"'Components and Space Standards'!E26:H26","v":"65 sf per station"},15,90.577500000000001,975,29,175.1165,1885,47,283.80950000000001,3055,80,483.08,5200,123,742.7355,7995,43,259.65550000000002,2795]
[{"$f":"'Components and Space Standards'!A27:E27","v":"Finess Program Manager's Office"},{"$f":"'Components and Space Standards'!B27:F27","v":11.612499999999999},{"$f":"'Components and Space Standards'!C27:G27","v":125},{"$f":"'Components and Space Standards'!D27:G27","v":"Office"},{"$f":"'Components and Space Standards'!E27:H27","v":"Private office that may include fitness testing equipment"},1,11.612499999999999,125,1,11.612499999999999,125,1,11.612499999999999,125,1,11.612499999999999,125,2,23.224999999999998,250,0.5,5.8062499999999995,62.5]
[{"$f":"'Components and Space Standards'!A28:E28","v":"Fitness Assessment Room"},{"$f":"'Components and Space Standards'!B28:F28","v":11.612499999999999},{"$f":"'Components and Space Standards'!C28:G28","v":125},{"$f":"'Components and Space Standards'!D28:G28","v":"Office(s)"},{"$f":"'Components and Space Standards'!E28:H28","v":"1 piece fitness equip for testing, computer desk, chairs, stretching"},null,0,0,1,11.612499999999999,125,2,23.224999999999998,250,3,34.837499999999999,375,3,34.837499999999999,375,0.5,5.8062499999999995,62.5]
[{"$f":"'Components and Space Standards'!A29:E29","v":"Structured Activities"}]
[{"$f":"'Components and Space Standards'!A30:E30","v":"Structured Activity Space"},{"$f":"'Components and Space Standards'!B30:F30","v":74.319999999999993},{"$f":"'Components and Space Standards'!C30:G30","v":800},{"$f":"'Components and Space Standards'!D30:G30","v":"Flexible space Module(s)"},{"$f":"'Components and Space Standards'!E30:H30","v":"Based on size of a single racquetball court"},1.5,{"$f":"$B30*F30","v":111.47999999999999},{"$f":"F30*$C30","v":1200},1.5,{"$f":"$B30*I30","v":111.47999999999999},{"$f":"I30*$C30","v":1200},3,{"$f":"$B30*L30","v":222.95999999999998},{"$f":"L30*$C30","v":2400},3,{"$f":"$B30*O30","v":222.95999999999998},{"$f":"O30*$C30","v":2400},4.5,{"$f":"$B30*R30","v":334.43999999999994},{"$f":"R30*$C30","v":3600},1.5,{"$f":"$B30*U30","v":111.47999999999999},{"$f":"U30*$C30","v":1200},"equip. based"]
[{"$f":"'Components and Space Standards'!A31:E31","v":"Racquetball Courts"},{"$f":"'Components and Space Standards'!B31:F31","v":74.319999999999993},{"$f":"'Components and Space Standards'!C31:G31","v":800},{"$f":"'Components and Space Standards'!D31:G31","v":"Racquetball Court(s)"},{"$f":"'Components and Space Standards'!E31:H31","v":"Single court size. Minimum of two courts"},1,{"$f":"$B31*F31","v":74.319999999999993},{"$f":"F31*$C31","v":800},1,{"$f":"$B31*I31","v":74.319999999999993},{"$f":"I31*$C31","v":800},1,{"$f":"$B31*L31","v":74.319999999999993},{"$f":"L31*$C31","v":800},2,{"$f":"$B31*O31","v":148.63999999999999},{"$f":"O31*$C31","v":1600},3,{"$f":"$B31*R31","v":222.95999999999998},{"$f":"R31*$C31","v":2400},1,{"$f":"$B31*U31","v":74.319999999999993},{"$f":"U31*$C31","v":800}]
[{"$f":"'Components and Space Standards'!A34:E34","v":"Spectator/officiating (MC Option)"},{"$f":"'Components and Space Standards'!B34:F34","v":18.579999999999998},{"$f":"'Components and Space Standards'!C34:G34","v":200},{"$f":"'Components and Space Standards'!D34:G34","v":"Spectator/officiating Module(s)"},{"$f":"'Components and Space Standards'!E34:H34","v":"Two rows of 10 seats for one ct. Max of two cts (400 sf)"},0,{"$f":"$B32*F32","v":0},{"$f":"F32*$C32","v":0},0,{"$f":"$B32*I32","v":0},{"$f":"I32*$C32","v":0},2,{"$f":"$B32*L32","v":37.159999999999997},{"$f":"L32*$C32","v":400},2,{"$f":"$B32*O32","v":37.159999999999997},{"$f":"O32*$C32","v":400},2,{"$f":"$B32*R32","v":37.159999999999997},{"$f":"R32*$C32","v":400},0,{"$f":"$B32*U32","v":0},{"$f":"U32*$C32","v":0}]
[{"$f":"'Components and Space Standards'!A35:E35","v":"Structured activity storage"},{"$f":"'Components and Space Standards'!B35:F35","v":7.4319999999999995},{"$f":"'Components and Space Standards'!C35:G35","v":80},{"$f":"'Components and Space Standards'!D35:G35","v":"10% of Structured Activity Space"},{"$f":"'Components and Space Standards'!E35:H35","v":"Based on Structured activity space (10% of room area)"}]
[{"$f":"'Components and Space Standards'!A36:E36","v":"Locker Rooms"},null,null,null,null,null,null,null,null,null,null,null,null,null,null,null,null,null,null,null,null,null,null,"Apply male/female split on occupant load, then calculate individual male and female locker areas from the split number."]
[{"$f":"'Components and Space Standards'!A37:E37","v":"Men's Locker Room"},{"$f":"'Components and Space Standards'!B37:F37","v":0},{"$f":"'Components and Space Standards'!C37:G37","v":0},{"$f":"'Components and Space Standards'!D37:G37","v":0},{"$f":"'Components and Space Standards'!E37:H37","v":0},null,{"$f":"$B35*F35","v":0},{"$f":"F35*$C35","v":0},null,{"$f":"$B35*I35","v":0},{"$f":"I35*$C35","v":0},null,{"$f":"$B35*L35","v":0},{"$f":"L35*$C35","v":0},null,{"$f":"$B35*O35","v":0},{"$f":"O35*$C35","v":0},null,{"$f":"$B35*R35","v":0},{"$f":"R35*$C35","v":0},null,{"$f":"$B35*U35","v":0},{"$f":"U35*$C35","v":0}]
[{"$f":"'Components and Space Standards'!A38:E38","v":"Locker/changing area"},{"$f":"'Components and Space Standards'!B38:F38","v":0.74319999999999997},{"$f":"'Components and Space Standards'!C38:G38","v":8},{"$f":"'Components and Space Standards'!D38:G38","v":"Lockers"},{"$f":"'Components and Space Standards'!E38:H38","v":"Per slot (2 double lockers or 1 single locker)"},null,0,0,null,0,0,null,0,0,null,0,0,null,0,0,null,0,0,"Ratios: 1 to 1 (all full), 66% (1 full per 2 dbls -  or 3 ppl / 2 slots), 50% (all double lockers) - Environmental adjust factor ----- "]
[{"$f":"'Components and Space Standards'!A39:E39","v":"Shower/drying area"},{"$f":"'Components and Space Standards'!B39:F39","v":2.7869999999999999},{"$f":"'Components and Space Standards'!C39:G39","v":30},{"$f":"'Components and Space Standards'!D39:G39","v":"Showers"},{"$f":"'Components and Space Standards'!E39:H39","v":"Per shower & integral drying area at 22 lockers/shower"},null,0,0,null,0,0,null,0,0,null,0,0,null,0,0,null,0,0]
[{"$f":"'Components and Space Standards'!A40:E40","v":"Toilet area"},{"$f":"'Components and Space Standards'!B40:F40","v":4.1804999999999994},{"$f":"'Components and Space Standards'!C40:G40","v":45},{"$f":"'Components and Space Standards'!D40:G40","v":"Water closets/lavatory modules"},{"$f":"'Components and Space Standards'!E40:H40","v":"Per wc and lav. at 30 lockers per wc/lav"},null,0,0,null,0,0,null,0,0,null,0,0,null,0,0,null,0,0,"Will confirm that 30 lockers per wc/lav is the correct formula"]
[{"$f":"'Components and Space Standards'!A41:E41","v":"Women's Locker Room"},{"$f":"'Components and Space Standards'!B41:F41","v":0},{"$f":"'Components and Space Standards'!C41:G41","v":0},{"$f":"'Components and Space Standards'!D41:G41","v":0},{"$f":"'Components and Space Standards'!E41:H41","v":0},null,0,0,null,0,0,null,0,0,null,0,0,null,0,0,null,0,0]
[{"$f":"'Components and Space Standards'!A42:E42","v":"Locker/changing area"},{"$f":"'Components and Space Standards'!B42:F42","v":0.74319999999999997},{"$f":"'Components and Space Standards'!C42:G42","v":8},{"$f":"'Components and Space Standards'!D42:G42","v":"Lockers"},{"$f":"'Components and Space Standards'!E42:H42","v":"Per slot (2 double lockers or 1 single locker)"},null,0,0,null,0,0,null,0,0,null,0,0,null,0,0,null,0,0]
[{"$f":"'Components and Space Standards'!A43:E43","v":"Shower/drying area"},{"$f":"'Components and Space Standards'!B43:F43","v":2.7869999999999999},{"$f":"'Components and Space Standards'!C43:G43","v":30},{"$f":"'Components and Space Standards'!D43:G43","v":"Showers"},{"$f":"'Components and Space Standards'!E43:H43","v":"Per shower & integral drying area at 22 lockers/shower"},null,0,0,null,0,0,null,0,0,null,0,0,null,0,0,null,0,0]
[{"$f":"'Components and Space Standards'!A44:E44","v":"Toilet area"},{"$f":"'Components and Space Standards'!B44:F44","v":4.1804999999999994},{"$f":"'Components and Space Standards'!C44:G44","v":45},{"$f":"'Components and Space Standards'!D44:G44","v":"Water closets/lavatory modules"},{"$f":"'Components and Space Standards'!E44:H44","v":"per wc and lav. at 20 lockers per wc/lav"},null,0,0,null,0,0,null,0,0,null,0,0,null,0,0,null,0,0,"Will confirm that 20 lockers per wc/lav is the correct formula"]
[{"$f":"'Components and Space Standards'!A45:E45","v":"Sauna, cool-down area"},{"$f":"'Components and Space Standards'!B45:F45","v":0},{"$f":"'Components and Space Standards'!C45:G45","v":0},{"$f":"'Components and Space Standards'!D45:G45","v":"M/F (2) Saunas/cool-down area"},{"$f":"'Components and Space Standards'!E45:H45","v":"small = 6 ppl, med = 8-9, lg = 12 ppl (+ cool down space)"},"Small",null,null,"Small",null,null,"Medium",null,null,"Large",null,null,"Large",null,null,"Small"]
[{"$f":"'Components and Space Standards'!A46:E46","v":"Steam Room, cool-down area"},{"$f":"'Components and Space Standards'!B46:F46","v":0},{"$f":"'Components and Space Standards'!C46:G46","v":0},{"$f":"'Components and Space Standards'!D46:G46","v":"M/F (2) Steam Rooms/cool-down area"},{"$f":"'Components and Space Standards'!E46:H46","v":"small = 6-7 ppl, med = 8-9, lg = 12-14 (+ cool down space)"},null,null,null,null,null,null,null,null,null,null,null,null,null,null,null,0]
[{"$f":"'Components and Space Standards'!A47:E47","v":"Hot Tub"},{"$f":"'Components and Space Standards'!B47:F47","v":0},{"$f":"'Components and Space Standards'!C47:G47","v":0},{"$f":"'Components and Space Standards'!D47:G47","v":"Unisex Hot Tub"},{"$f":"'Components and Space Standards'!E47:H47","v":"small = 5 ppl, med = 8, lg = 12-14 ppl"},null,null,null,null,null,null,null,null,null,null,null,null,null,null,null,0]
[{"$f":"'Components and Space Standards'!A48:E48","v":"Support Areas"}]
[{"$f":"'Components and Space Standards'!A49:E49","v":"Laundry"},{"$f":"'Components and Space Standards'!B49:F49","v":18.579999999999998},{"$f":"'Components and Space Standards'!C49:G49","v":200},{"$f":"'Components and Space Standards'!D49:G49","v":"Laundry Room"},{"$f":"'Components and Space Standards'!E49:H49","v":"Per one-washer/two-dryer room"},"1/2 machine combo",null,null,"1/2 machine combo",null,null,"2/4 machine combo",null,null,"3/6 machine combo",null,null,"4/8 machine combo",null,null,"1/1",null,null,"One washer, two dryers, commercial equip, folding table, sink, storage shelves, laundry carts, and opt. ice machine."]
[{"$f":"'Components and Space Standards'!A50:E50","v":"Equipment repair and receiving"},{"$f":"'Components and Space Standards'!B50:F50","v":0},{"$f":"'Components and Space Standards'!C50","v":0},{"$f":"'Components and Space Standards'!D50:G50","v":"Repair/receiving Room"},{"$f":"'Components and Space Standards'!E50:H50","v":"Fixed receiving area + variable repair (10% of Fitness)"},null,null,null,null,null,null,null,null,null,null,null,null,null,null,null,1,null,null,"10% of total Fitness (Army) / 250 sf (AF)"]
[{"$f":"'Components and Space Standards'!A51:E51","v":"Storage"},{"$f":"'Components and Space Standards'!B51:F51","v":0},{"$f":"'Components and Space Standards'!C51","v":0},{"$f":"'Components and Space Standards'!D51:G51","v":"Storage Room"},{"$f":"'Components and Space Standards'!E51:H51","v":"Variable lockable storage room (5% of fitness)"}]
[{"$f":"'Components and Space Standards'!A52:E52","v":"Additional Programmatic Storage"},{"$f":"'Components and Space Standards'!B52:F52","v":0},{"$f":"'Components and Space Standards'!C52","v":0},{"$f":"'Components and Space Standards'!D52:G52","v":" sf  Additional Storage"},{"$f":"'Components and Space Standards'!E52:H52","v":"To be filled-in by programmer and justified based on item stored."},null,null,100,null,null,200,null,null,300,null,null,400,null,null,500,null,null,100]
[{"$f":"'Components and Space Standards'!A54:E54","v":"Health Promotion Spaces - Marine Corps Only (Required or Optional)"},{"$f":"'Components and Space Standards'!B54:F54","v":0},{"$f":"'Components and Space Standards'!C54:G54","v":0},null,{"$f":"'Components and Space Standards'!E54:H54","v":0}]
[{"$f":"'Components and Space Standards'!A55:E55","v":"Lobby/Reception"},{"$f":"'Components and Space Standards'!B55:F55","v":27.869999999999997},{"$f":"'Components and Space Standards'!C55:G55","v":300},{"$f":"'Components and Space Standards'!D55:G55","v":"Lobby/Reception Module(s)"},{"$f":"'Components and Space Standards'!E55:H55","v":"per area"},0,{"$f":"$B52*F52","v":0},{"$f":"F52*$C52","v":0},0,{"$f":"$B52*I52","v":0},{"$f":"I52*$C52","v":0},0,{"$f":"$B52*L52","v":0},{"$f":"L52*$C52","v":0},0,{"$f":"$B52*O52","v":0},{"$f":"O52*$C52","v":0},0,{"$f":"$B52*R52","v":0},{"$f":"R52*$C52","v":0},0,{"$f":"$B52*U52","v":0},{"$f":"U52*$C52","v":0},"From AF"]
[{"$f":"'Components and Space Standards'!A56:E56","v":"Director's Office"},{"$f":"'Components and Space Standards'!B56:F56","v":11.148},{"$f":"'Components and Space Standards'!C56:G56","v":120},{"$f":"'Components and Space Standards'!D56:G56","v":"Office"},{"$f":"'Components and Space Standards'!E56:H56","v":"per office"},0,0,0,0,0,0,0,0,0,0,0,0,0,0,0,0,0,0,"AF office area = 400 sf total"]
[{"$f":"'Components and Space Standards'!A57:E57","v":"Program Managers' Offices"},{"$f":"'Components and Space Standards'!B57:F57","v":9.2899999999999991},{"$f":"'Components and Space Standards'!C57:G57","v":100},{"$f":"'Components and Space Standards'!D57:G57","v":"Office(s)"},{"$f":"'Components and Space Standards'!E57:H57","v":"per office"},0,0,0,0,0,0,0,0,0,0,0,0,0,0,0,0,0,0]
[{"$f":"'Components and Space Standards'!A58:E58","v":"Support Staff Workstations"},{"$f":"'Components and Space Standards'!B58:F58","v":5.9455999999999998},{"$f":"'Components and Space Standards'!C58:G58","v":64},{"$f":"'Components and Space Standards'!D58:G58","v":"Workstation(s)"},{"$f":"'Components and Space Standards'!E58:H58","v":"per workstation"},0,0,0,0,0,0,0,0,0,0,0,0,0,0,0,0,0,0]
[{"$f":"'Components and Space Standards'!A59:E59","v":"Classrooms/Training rooms"},{"$f":"'Components and Space Standards'!B59:F59","v":58.527000000000001},{"$f":"'Components and Space Standards'!C59:G59","v":630},{"$f":"'Components and Space Standards'!D59:G59","v":"Classroom/Training Module(s)"},{"$f":"'Components and Space Standards'!E59:H59","v":"per room"},0,0,0,0,0,0,0,0,0,0,0,0,0,0,0,0,0,0,"From AF"]
[{"$f":"'Components and Space Standards'!A60:E60","v":"Resource Room/Computer Lab"},{"$f":"'Components and Space Standards'!B60:F60","v":23.224999999999998},{"$f":"'Components and Space Standards'!C60:G60","v":250},{"$f":"'Components and Space Standards'!D60:G60","v":"Resource/Computer Lab Module(s)"},{"$f":"'Components and Space Standards'!E60:H60","v":"per room"},0,0,0,0,0,0,0,0,0,0,0,0,0,0,0,0,0,0,"From AF - combines comp lab with resource library"]
[{"$f":"'Components and Space Standards'!A61:E61","v":"Storage/support"},{"$f":"'Components and Space Standards'!B61:F61","v":7.4319999999999995},{"$f":"'Components and Space Standards'!C61:G61","v":80},{"$f":"'Components and Space Standards'!D61:G61","v":"Storage/support Module(s)"},{"$f":"'Components and Space Standards'!E61:H61","v":"per area"},0,0,0,0,0,0,0,0,0,0,0,0,0,0,0,0,0,0]
[{"$f":"'Components and Space Standards'!A63:E63","v":"Ergometry and Fitness Testing *"},{"$f":"'Components and Space Standards'!B63:F63","v":7.4319999999999995},{"$f":"'Components and Space Standards'!C63:G63","v":80},{"$f":"'Components and Space Standards'!D63:G63","v":"Testing Cubicle(s)"},{"$f":"'Components and Space Standards'!E63:H63","v":"per testing cubicles"},0,0,0,0,0,0,0,0,0,0,0,0,0,0,0,0,0,0,"From AF - cubicles go in an enclosed room (need circulation beteen cubicles--doesn't seem to be accounted for in AF criteria?)"]
[{"$f":"'Components and Space Standards'!A64:E64","v":"Wellness Assessment *"},{"$f":"'Components and Space Standards'!B64:F64","v":13.934999999999999},{"$f":"'Components and Space Standards'!C64:G64","v":150},{"$f":"'Components and Space Standards'!D64:G64","v":"Assessment Room(s)"},{"$f":"'Components and Space Standards'!E64:H64","v":"per room"},0,0,0,0,0,0,0,0,0,0,0,0,0,0,0,0,0,0,"From AF"]
[{"$f":"'Components and Space Standards'!A65:E65","v":"Administrative Spaces (required or optional)"},{"$f":"'Components and Space Standards'!B65:F65","v":0},{"$f":"'Components and Space Standards'!C65:G65","v":0},null,{"$f":"'Components and Space Standards'!E65:H65","v":0}]
[{"$f":"'Components and Space Standards'!A66:E66","v":"Director's Office"},{"$f":"'Components and Space Standards'!B66:F66","v":11.148},{"$f":"'Components and Space Standards'!C66:G66","v":120},{"$f":"'Components and Space Standards'!D66:G66","v":"Office"},{"$f":"'Components and Space Standards'!E66:H66","v":"per office"},1,{"$f":"$B62*F62","v":11.148},{"$f":"F62*$C62","v":120},1,{"$f":"$B62*I62","v":11.148},{"$f":"I62*$C62","v":120},1,{"$f":"$B62*L62","v":11.148},{"$f":"L62*$C62","v":120},1,{"$f":"$B62*O62","v":11.148},{"$f":"O62*$C62","v":120},1,{"$f":"$B62*R62","v":11.148},{"$f":"R62*$C62","v":120},null,{"$f":"$B62*U62","v":0},{"$f":"U62*$C62","v":0},"req."]
[{"$f":"'Components and Space Standards'!A67:E67","v":"Program Managers' Offices"},{"$f":"'Components and Space Standards'!B67:F67","v":9.2899999999999991},{"$f":"'Components and Space Standards'!C67:G67","v":100},{"$f":"'Components and Space Standards'!D67:G67","v":"Office(s)"},{"$f":"'Components and Space Standards'!E67:H67","v":"per office"},0,0,0,1,9.2899999999999991,100,1,9.2899999999999991,100,1,9.2899999999999991,100,1,9.2899999999999991,100,null,0,0,"optional (req. AF)"]
[{"$f":"'Components and Space Standards'!A68:E68","v":"Support Staff Workstations"},{"$f":"'Components and Space Standards'!B68:F68","v":5.9455999999999998},{"$f":"'Components and Space Standards'!C68:G68","v":64},{"$f":"'Components and Space Standards'!D68:G68","v":"Workstation(s)"},{"$f":"'Components and Space Standards'!E68:H68","v":"per office"},3,17.8368,192,4,23.782399999999999,256,6,35.6736,384,8,47.564799999999998,512,9,53.510399999999997,576,1,5.9455999999999998,64,"optional (req. AF)"]
[{"$f":"'Components and Space Standards'!A69:E69","v":"Copy/file/work/break Room"},{"$f":"'Components and Space Standards'!B69:F69","v":7.4319999999999995},{"$f":"'Components and Space Standards'!C69:G69","v":80},{"$f":"'Components and Space Standards'!D69:G69","v":"Workroom Module(s)"},{"$f":"'Components and Space Standards'!E69:H69","v":"per room"},2,14.863999999999999,160,3,22.295999999999999,240,2,14.863999999999999,160,2,14.863999999999999,160,2,14.863999999999999,160,null,0,0,"req."]
[{"$f":"'Components and Space Standards'!A70:E70","v":"Classroom/Training Room"},{"$f":"'Components and Space Standards'!B70:F70","v":69.674999999999997},{"$f":"'Components and Space Standards'!C70:G70","v":750},{"$f":"'Components and Space Standards'!D70:G70","v":"25-person Module at 750 SF"},{"$f":"'Components and Space Standards'!E70:H70","v":"1,500 SF Med/Lge & 2,250 SF for Xtra Lge/Jumbo"},0,0,0,0,0,0,1,69.674999999999997,750,1,69.674999999999997,750,1,69.674999999999997,750,null,0,0,"Req. Program space"]
[{"$f":"'Components and Space Standards'!A71:E71","v":"Classroom/Training Storage"},{"$f":"'Components and Space Standards'!B71:F71","v":5.5739999999999998},{"$f":"'Components and Space Standards'!C71:G71","v":60},{"$f":"'Components and Space Standards'!D71:G71","v":"Storage Module(s)"},{"$f":"'Components and Space Standards'!E71:H71","v":"per 25-person Training Room"},0,0,0,0,0,0,1,5.5739999999999998,60,1,5.5739999999999998,60,1,5.5739999999999998,60,null,0,0]
[{"$f":"'Components and Space Standards'!A72:E72","v":"Optional or Service-specific Program Spaces"},{"$f":"'Components and Space Standards'!B72:F72","v":0},{"$f":"'Components and Space Standards'!C72:G72","v":0},null,{"$f":"'Components and Space Standards'!E72:H72","v":0}]
[{"$f":"'Components and Space Standards'!A75:E75","v":"Indoor Track"}]
[{"$f":"'Components and Space Standards'!A76:E76","v":"Indoor Track"}]
[{"$f":"'Components and Space Standards'!A77:E77","v":"1/14th-mile Indoor Track"},{"$f":"'Components and Space Standards'!B77:F77","v":310.00729999999999},{"$f":"'Components and Space Standards'!C77:G77","v":3337},{"$f":"'Components and Space Standards'!D77:G77","v":"1/14th-mile, 2-lane Indoor Track "},{"$f":"'Components and Space Standards'!E77:H77","v":"1/14th-mile, 2-lane Indoor Track (754 linear ft.)"},1,{"$f":"$B71*F71","v":310.00729999999999},{"$f":"F71*$C71","v":3337},null,{"$f":"$B71*I71","v":0},{"$f":"I71*$C71","v":0},null,{"$f":"$B71*L71","v":0},{"$f":"L71*$C71","v":0},null,{"$f":"$B71*O71","v":0},{"$f":"O71*$C71","v":0},null,{"$f":"$B71*R71","v":0},{"$f":"R71*$C71","v":0},null,{"$f":"$B71*U71","v":0},{"$f":"U71*$C71","v":0},"(smallest gym option, Army and Navy only)"]
[{"$f":"'Components and Space Standards'!A78:E78","v":"1/12th-mile Indoor Track"},{"$f":"'Components and Space Standards'!B78:F78","v":523.02699999999993},{"$f":"'Components and Space Standards'!C78:G78","v":5630},{"$f":"'Components and Space Standards'!D78:G78","v":"1/12th-mile, 3-lane Indoor Track"},{"$f":"'Components and Space Standards'!E78:H78","v":"1/12th-mile, 3-lane Indoor Track (1284 linear ft.)"},null,0,{"$f":"F72*$C72","v":0},1,523.02699999999993,{"$f":"I72*$C72","v":5630},null,0,{"$f":"L72*$C72","v":0},null,0,{"$f":"O72*$C72","v":0},null,0,{"$f":"R72*$C72","v":0},null,0,{"$f":"U72*$C72","v":0}]
[{"$f":"'Components and Space Standards'!A79:E79","v":"1/11th-mile Indoor Track"},{"$f":"'Components and Space Standards'!B79:F79","v":556.74969999999996},{"$f":"'Components and Space Standards'!C79:G79","v":5993},{"$f":"'Components and Space Standards'!D79:G79","v":"1/11th-mile, 3-lane Indoor Track "},{"$f":"'Components and Space Standards'!E79:H79","v":"1/11th-mile, 3-lane Indoor Track (1440 linear ft.)"},null,0,0,null,0,0,1,556.74969999999996,5993,1,556.74969999999996,5993,1,556.74969999999996,5993,null,0,0]
[{"$f":"'Components and Space Standards'!A80:E80","v":"1/8th-mile Indoor Track"},{"$f":"'Components and Space Standards'!B80:F80","v":989.10629999999992},{"$f":"'Components and Space Standards'!C80:G80","v":10647},{"$f":"'Components and Space Standards'!D80:G80","v":"1/8th-mile, 4-lane Indoor Track "},{"$f":"'Components and Space Standards'!E80:H80","v":"1/8th-mile, 4-lane Indoor Track (2640 linear ft.)"},null,0,0,null,0,0,null,0,0,null,0,0,null,0,0,null,0,0]
[{"$f":"'Components and Space Standards'!A81:E81","v":"Indoor track lobby"},{"$f":"'Components and Space Standards'!B81:F81","v":13.377599999999999},{"$f":"'Components and Space Standards'!C81:G81","v":144},{"$f":"'Components and Space Standards'!D81:G81","v":"Indoor track lobby(ies)"},{"$f":"'Components and Space Standards'!E81:H81","v":"Access point to lobby from stair/elevator"},1,13.377599999999999,144,1.5,20.066399999999998,216,1.5,20.066399999999998,216,1.5,20.066399999999998,216,1.5,20.066399999999998,216,null,0,0]
[{"$f":"'Components and Space Standards'!A82:E82","v":"Additional Group Exercise Room"},{"$f":"'Components and Space Standards'!B82:F82","v":116.125},{"$f":"'Components and Space Standards'!C82:G82","v":1250},{"$f":"'Components and Space Standards'!D82:G82","v":"Additional Group Exercise Room"},{"$f":"'Components and Space Standards'!E82:H82","v":"per room"},null,0,0,null,0,0,null,0,0,null,0,0,null,0,0,null,0,0,"Optional catch-up space"]
[{"$f":"'Components and Space Standards'!A83:E83","v":"Massage Room"},{"$f":"'Components and Space Standards'!B83:F83","v":11.148},{"$f":"'Components and Space Standards'!C83:G83","v":120},{"$f":"'Components and Space Standards'!D83:G83","v":"Massage Room(s)"},{"$f":"'Components and Space Standards'!E83:H83","v":"per room"},null,0,0,null,0,0,null,0,0,null,0,0,null,0,0,null,0,0]
[{"$f":"'Components and Space Standards'!A84:E84","v":"Physical Therapy Training"},{"$f":"'Components and Space Standards'!B84:F84","v":11.612499999999999},{"$f":"'Components and Space Standards'!C84:G84","v":125},{"$f":"'Components and Space Standards'!D84:G84","v":"Physical Therapy Training Room(s)"},{"$f":"'Components and Space Standards'!E84:H84","v":"per room"},null,0,0,null,0,0,null,0,0,null,0,0,null,0,0,null,0,0,"similar to fitness assement"]
[{"$f":"'Components and Space Standards'!A85:E85","v":"Expanded Retail 1"},{"$f":"'Components and Space Standards'!B85:F85","v":9.2899999999999991},{"$f":"'Components and Space Standards'!C85:G85","v":100},{"$f":"'Components and Space Standards'!D85:G85","v":"Expanded Retail Module(s)"},{"$f":"'Components and Space Standards'!E85:H85","v":"per area"},null,0,0,null,0,0,null,0,0,null,0,0,null,0,0,null,0,0,"dry good, sports equip, clothes, etc. Usually contractor and sep from control"]
[{"$f":"'Components and Space Standards'!A86:E86","v":"Expanded Juice Bar 1"},{"$f":"'Components and Space Standards'!B86:F86","v":13.934999999999999},{"$f":"'Components and Space Standards'!C86:G86","v":150},{"$f":"'Components and Space Standards'!D86:G86","v":"Expanded Juice Bar Module(s)"},{"$f":"'Components and Space Standards'!E86:H86","v":"per area"},null,0,0,null,0,0,null,0,0,null,0,0,null,0,0,null,0,0,"Additional food/beverage counter. Usually contractor and sep from control"]
[{"$f":"'Components and Space Standards'!A87:E87","v":"Expanded Juice Bar Seating"},{"$f":"'Components and Space Standards'!B87:F87","v":13.934999999999999},{"$f":"'Components and Space Standards'!C87:G87","v":150},{"$f":"'Components and Space Standards'!D87:G87","v":"Two-table seating Module(s)"},{"$f":"'Components and Space Standards'!E87:H87","v":"Two 4-top tables and seating area"},null,0,0,null,0,0,null,0,0,null,0,0,null,0,0,null,0,0]
[{"$f":"'Components and Space Standards'!A88:E88","v":"Family Changing Room"},{"$f":"'Components and Space Standards'!B88:F88","v":10.218999999999999},{"$f":"'Components and Space Standards'!C88:G88","v":110},{"$f":"'Components and Space Standards'!D88:G88","v":"Family Changing Room(s)"},{"$f":"'Components and Space Standards'!E88:H88","v":"per shower, wc, lav, changing, and locker"},null,0,0,null,0,0,null,0,0,null,0,0,null,0,0,null,0,0,"Indiv. locker area for parent & child (grows by adding showers and changing stalls plus lockers)"]
[{"$f":"'Components and Space Standards'!A89:E89","v":"Convertible Locker Space"},{"$f":"'Components and Space Standards'!B89:F89","v":69.674999999999997},{"$f":"'Components and Space Standards'!C89:G89","v":750},{"$f":"'Components and Space Standards'!D89:G89","v":"Add'l male or female space"},{"$f":"'Components and Space Standards'!E89:H89","v":"750 sf"},null,0,0,null,0,0,null,0,0,null,0,0,null,0,0,null,0,0,"AF-only option. Calculate how many people this accomodates"]
[{"$f":"'Components and Space Standards'!A90:E90","v":"Female DV Locker Room *"},{"$f":"'Components and Space Standards'!B90:F90","v":23.224999999999998},{"$f":"'Components and Space Standards'!C90:G90","v":250},{"$f":"'Components and Space Standards'!D90:G90","v":"Female DV Locker Room"},{"$f":"'Components and Space Standards'!E90:H90","v":"250, 500, 750"},null,0,0,null,0,0,null,0,0,null,0,0,null,0,0,null,0,0]
[{"$f":"'Components and Space Standards'!A91:E91","v":"Child Play Area/Parent Child Area *"},{"$f":"'Components and Space Standards'!B91:F91","v":74.319999999999993},{"$f":"'Components and Space Standards'!C91:G91","v":800},{"$f":"'Components and Space Standards'!D91:G91","v":"Parent/child Module(s)"},{"$f":"'Components and Space Standards'!E91:H91","v":"400 sf play area (at 35 sf/child), 400 sf equip (50 sf/equip)"},null,0,0,null,0,0,null,0,0,null,0,0,null,0,0,null,0,0]
[{"$f":"'Components and Space Standards'!A92:E92","v":"HAWC Demonstration Kitchen"},{"$f":"'Components and Space Standards'!B92:F92","v":46.449999999999996},{"$f":"'Components and Space Standards'!C92:G92","v":500},{"$f":"'Components and Space Standards'!D92:G92","v":"Kitchen Module(s)"},{"$f":"'Components and Space Standards'!E92:H92","v":"per kitchen"},null,0,0,null,0,0,null,0,0,null,0,0,null,0,0,null,0,0,"From AF"]
[{"$f":"'Components and Space Standards'!A93:E93","v":"HAWC Relaxation Room *"},{"$f":"'Components and Space Standards'!B93:F93","v":9.2899999999999991},{"$f":"'Components and Space Standards'!C93:G93","v":100},{"$f":"'Components and Space Standards'!D93:G93","v":"Relaxation Room(s)"},{"$f":"'Components and Space Standards'!E93:H93","v":"per room"},null,0,0,null,0,0,null,0,0,null,0,0,null,0,0,null,0,0,"From AF"]
[{"$f":"'Components and Space Standards'!A94:E94","v":"Site Spaces"}]
[{"$f":"'Components and Space Standards'!A95:E95","v":"Staff Parking"},{"$f":"'Components and Space Standards'!B95:F95","v":41.805},{"$f":"'Components and Space Standards'!C95:G95","v":450},{"$f":"'Components and Space Standards'!D95:G95","v":"Parking Spaces"},{"$f":"'Components and Space Standards'!E95:H95","v":"per space (including circulation)"},6,{"$f":"F89*B89","v":250.82999999999998},{"$f":"F89*C89","v":2700},6,{"$f":"$B89*I89","v":250.82999999999998},{"$f":"I89*$C89","v":2700},6,{"$f":"$B89*L89","v":250.82999999999998},{"$f":"L89*$C89","v":2700},6,{"$f":"$B89*O89","v":250.82999999999998},{"$f":"O89*$C89","v":2700},10,{"$f":"$B89*R89","v":418.05},{"$f":"R89*$C89","v":4500},null,{"$f":"$B89*U89","v":0},{"$f":"U89*$C89","v":0}]
[{"$f":"'Components and Space Standards'!A96:E96","v":"Loading dock"},{"$f":"'Components and Space Standards'!B96:F96","v":8.3609999999999989},{"$f":"'Components and Space Standards'!C96:G96","v":90},{"$f":"'Components and Space Standards'!D96:G96","v":"Loading Dock"},{"$f":"'Components and Space Standards'!E96:H96","v":"Per single-truck dock"},1,8.3609999999999989,90,1,8.3609999999999989,90,1,8.3609999999999989,90,1,8.3609999999999989,90,2,16.721999999999998,180,null,0,0]
[{"$f":"'Components and Space Standards'!A97:E97","v":"Service Drive/trash"},{"$f":"'Components and Space Standards'!B97:F97","v":69.674999999999997},{"$f":"'Components and Space Standards'!C97:G97","v":750},{"$f":"'Components and Space Standards'!D97:G97","v":"Service Drive Module"},{"$f":"'Components and Space Standards'!E97:H97","v":"per area"},1,69.674999999999997,750,1,69.674999999999997,750,1,69.674999999999997,750,1,69.674999999999997,750,2,139.35,1500,null,0,0]
[{"$f":"'Components and Space Standards'!A98:E98","v":"Customer Parking"},{"$f":"'Components and Space Standards'!B98:F98","v":41.805},{"$f":"'Components and Space Standards'!C98:G98","v":450},{"$f":"'Components and Space Standards'!D98:G98","v":"Parking Spaces"},{"$f":"'Components and Space Standards'!E98:H98","v":"per space (including circulation)"},92,3846.06,41400,147,6145.335,66150,215,8988.0750000000007,96750,298,12457.89,134100,400,16722,180000,null,0,0]
[{"$f":"'Components and Space Standards'!A99:E99","v":"Bicycle Rack Area"},{"$f":"'Components and Space Standards'!B99:F99","v":14.863999999999999},{"$f":"'Components and Space Standards'!C99:G99","v":160},{"$f":"'Components and Space Standards'!D99:G99","v":"10-bike Rack(s)"},{"$f":"'Components and Space Standards'!E99:H99","v":"per 10-bike Rack"},1,14.863999999999999,160,2,29.727999999999998,320,3,44.591999999999999,480,5,74.319999999999993,800,7,104.04799999999999,1120,null,0,0]
[{"$f":"'Components and Space Standards'!A100:E100","v":"Patio"},{"$f":"'Components and Space Standards'!B100:F100","v":2.3224999999999998},{"$f":"'Components and Space Standards'!C100:G100","v":25},{"$f":"'Components and Space Standards'!D100:G100","v":"Patio Module(s)"},{"$f":"'Components and Space Standards'!E100:H100","v":"per patio"},null,0,0,null,0,0,null,0,0,null,0,0,null,0,0,null,0,0]
[{"$f":"'Components and Space Standards'!A101:E101","v":"* Service-specific space."}]
[{"$f":"'Components and Space Standards'!A102:E102","v":"1 If contract service, verify area with contractor. "}]

{"sheet":"Navy","index":4,"n_rows":97,"n_cols":24,"rows_kept":97,"cut":false,"hidden":true,"merged":[[68,0,68,4],[51,0,51,4],[2,0,2,4],[61,0,61,4],[83,23,84,23],[22,23,27,23],[12,23,15,23],[33,23,34,23],[47,23,48,23],[66,23,67,23],[0,23,1,23],[0,17,0,19],[0,5,0,7],[0,1,0,4],[0,8,0,10],[0,11,0,13],[0,14,0,16],[0,20,0,22]]}
["Col. A - D refer to \"Components & Space Standards\" Sheet.","Space Allocation Standard",null,null,null,"Extra Small",null,null,"Small",null,null,"Medium",null,null,"Large",null,null,"Extra Large",null,null,"Jumbo",null,null,"Notes"]
["Functional Component","m2","ft.2","Standard","Description","No.","m2","ft.2","No.","m2","ft.2","No.","m2","ft.2","No.","m2","ft.2","No.","m2","ft.2","No.","m2","ft.2"]
[{"$f":"'Components and Space Standards'!A3:E3","v":"Fitness Spaces"}]
[{"$f":"'Components and Space Standards'!A4:E4","v":"Lobby/Reception"}]
[{"$f":"'Components and Space Standards'!A5:E5","v":"Entry Lobby"},{"$f":"'Components and Space Standards'!B5:F5","v":9.2899999999999991},{"$f":"'Components and Space Standards'!C5:G5","v":100},{"$f":"'Components and Space Standards'!D5:G5","v":"Vestibule/Lobby Module(s) (for 2-3 ppl)"},{"$f":"'Components and Space Standards'!E5:H5","v":"Vesibule and/or space for 2 to 3 ppl to queue"},1,{"$f":"$B5*F5","v":9.2899999999999991},{"$f":"F5*$C5","v":100},2,{"$f":"$B5*I5","v":18.579999999999998},{"$f":"I5*$C5","v":200},3,{"$f":"$B5*L5","v":27.869999999999997},{"$f":"L5*$C5","v":300},4,{"$f":"$B5*O5","v":37.159999999999997},{"$f":"O5*$C5","v":400},5,{"$f":"$B5*R5","v":46.449999999999996},{"$f":"R5*$C5","v":500},6,{"$f":"$B5*U5","v":55.739999999999995},{"$f":"U5*$C5","v":600},"between bldg entrance and control"]
[{"$f":"'Components and Space Standards'!A6:E6","v":"Control Counter"},{"$f":"'Components and Space Standards'!B6:F6","v":11.612499999999999},{"$f":"'Components and Space Standards'!C6:G6","v":125},{"$f":"'Components and Space Standards'!D6:G6","v":"Counter Module(s)"},{"$f":"'Components and Space Standards'!E6:H6","v":"Space for counter, space behind, space in front"},1,{"$f":"$B6*F6","v":11.612499999999999},{"$f":"F6*$C6","v":125},1,{"$f":"$B6*I6","v":11.612499999999999},{"$f":"I6*$C6","v":125},2,{"$f":"$B6*L6","v":23.224999999999998},{"$f":"L6*$C6","v":250},3,{"$f":"$B6*O6","v":34.837499999999999},{"$f":"O6*$C6","v":375},4,{"$f":"$B6*R6","v":46.449999999999996},{"$f":"R6*$C6","v":500},4,{"$f":"$B6*U6","v":46.449999999999996},{"$f":"U6*$C6","v":500},"Includes minor retail items"]
[{"$f":"'Components and Space Standards'!A7:E7","v":"Equipment issue storage"},{"$f":"'Components and Space Standards'!B7:F7","v":16.2575},{"$f":"'Components and Space Standards'!C7:G7","v":175},{"$f":"'Components and Space Standards'!D7:G7","v":"Storage Module(s)"},{"$f":"'Components and Space Standards'!E7:H7","v":"Equipment storage at/behind gear issue "},2,{"$f":"$B7*F7","v":32.515000000000001},{"$f":"F7*$C7","v":350},2,{"$f":"$B7*I7","v":32.515000000000001},{"$f":"I7*$C7","v":350},2,{"$f":"$B7*L7","v":32.515000000000001},{"$f":"L7*$C7","v":350},3,{"$f":"$B7*O7","v":48.772500000000001},{"$f":"O7*$C7","v":525},3,{"$f":"$B7*R7","v":48.772500000000001},{"$f":"R7*$C7","v":525},4,{"$f":"$B7*U7","v":65.03},{"$f":"U7*$C7","v":700},"2 units min. for Navy. Others get 1 unit in smallest"]
[{"$f":"'Components and Space Standards'!A8:E8","v":"Vending"},{"$f":"'Components and Space Standards'!B8:F8","v":1.8579999999999999},{"$f":"'Components and Space Standards'!C8:G8","v":20},{"$f":"'Components and Space Standards'!D8:G8","v":"Vending Machine(s)"},{"$f":"'Components and Space Standards'!E8:H8","v":"per vending machine"},1,{"$f":"$B8*F8","v":1.8579999999999999},{"$f":"F8*$C8","v":20},1,{"$f":"$B8*I8","v":1.8579999999999999},{"$f":"I8*$C8","v":20},1,{"$f":"$B8*L8","v":1.8579999999999999},{"$f":"L8*$C8","v":20},1,{"$f":"$B8*O8","v":1.8579999999999999},{"$f":"O8*$C8","v":20},1,{"$f":"$B8*R8","v":1.8579999999999999},{"$f":"R8*$C8","v":20},1,{"$f":"$B8*U8","v":1.8579999999999999},{"$f":"U8*$C8","v":20},"2 for small"]
[{"$f":"'Components and Space Standards'!A9:E9","v":"Waiting/Display"},{"$f":"'Components and Space Standards'!B9:F9","v":8.3609999999999989},{"$f":"'Components and Space Standards'!C9:G9","v":90},{"$f":"'Components and Space Standards'!D9:G9","v":"Seating/Display Module(s) (for 4 ppl)"},{"$f":"'Components and Space Standards'!E9:H9","v":"Space for seating for 4 ppl and display area"},1,{"$f":"$B9*F9","v":8.3609999999999989},{"$f":"F9*$C9","v":90},2,{"$f":"$B9*I9","v":16.721999999999998},{"$f":"I9*$C9","v":180},2,{"$f":"$B9*L9","v":16.721999999999998},{"$f":"L9*$C9","v":180},4,{"$f":"$B9*O9","v":33.443999999999996},{"$f":"O9*$C9","v":360},5,{"$f":"$B9*R9","v":41.804999999999993},{"$f":"R9*$C9","v":450},5,{"$f":"$B9*U9","v":41.804999999999993},{"$f":"U9*$C9","v":450},"Waiting area adjacent to lobby and in front of control. Grows in units of 90"]
[{"$f":"'Components and Space Standards'!A10:E10","v":"Spectator peak-time circulation"},{"$f":"'Components and Space Standards'!B10:F10","v":27.869999999999997},{"$f":"'Components and Space Standards'!C10:G10","v":300},{"$f":"'Components and Space Standards'!D10:G10","v":"Circulation Module(s)"},{"$f":"'Components and Space Standards'!E10:H10","v":"Per one-side bleachers - driven by gym size"},null,null,null,null,null,null,null,null,null,null,null,null,null,null,null,null,null,null,"Optional, 300 sf for 1 set bleachers, Additional circulation space for peak gym loads"]
[{"$f":"'Components and Space Standards'!A11:E11","v":"Public restrooms/phones"},{"$f":"'Components and Space Standards'!B11:F11","v":0},{"$f":"'Components and Space Standards'!C11:G11","v":0},{"$f":"'Components and Space Standards'!D11:G11","v":"Public Restroom(s)"},{"$f":"'Components and Space Standards'!E11:H11","v":"Option - Driven by gym size"},null,null,null,null,null,null,null,null,null,null,null,null,null,null,null,null,null,null,"1 (uni), 1/1, ?/?, 4/6 (limit option to those below the facility size) Largest gym size drives largest bathroom. AF limited to top three options."]
[{"$f":"'Components and Space Standards'!A12:E12","v":"Gymnasium"}]
[{"$f":"'Components and Space Standards'!A13:E13","v":"Basketball/volleyball Court"},{"$f":"'Components and Space Standards'!B13:F13","v":826.06679999999994},{"$f":"'Components and Space Standards'!C13:G13","v":8892},{"$f":"'Components and Space Standards'!D13:G13","v":"One-court/200-seat Module(s)"},{"$f":"'Components and Space Standards'!E13:H13","v":"NCAA Court + 10' safety + 200 seats (one side)"},1,{"$f":"$B13*F13","v":826.06679999999994},{"$f":"F13*$C13","v":8892},1,{"$f":"$B13*I13","v":826.06679999999994},{"$f":"I13*$C13","v":8892},0,{"$f":"$B13*L13","v":0},{"$f":"L13*$C13","v":0},1,{"$f":"$B13*O13","v":826.06679999999994},{"$f":"O13*$C13","v":8892},0,{"$f":"$B13*R13","v":0},{"$f":"R13*$C13","v":0},0,{"$f":"$B13*U13","v":0},{"$f":"U13*$C13","v":0},"Need both elements if indoor track is required."]
[{"$f":"'Components and Space Standards'!A14:E14","v":"Two Court Module"},{"$f":"'Components and Space Standards'!B14:F14","v":1630.9523999999999},{"$f":"'Components and Space Standards'!C14:G14","v":17556},{"$f":"'Components and Space Standards'!D14:G14","v":"Two-court/200-seat Module(s)"},{"$f":"'Components and Space Standards'!E14:H14","v":"Two courts + 10' safety, 16' between cts, + 200 seats"},0,0,{"$f":"F14*$C14","v":0},0,0,{"$f":"I14*$C14","v":0},1,1630.9523999999999,{"$f":"L14*$C14","v":17556},1,1630.9523999999999,{"$f":"O14*$C14","v":17556},2,3261.9047999999998,{"$f":"R14*$C14","v":35112},3,4892.8571999999995,52668]
[{"$f":"'Components and Space Standards'!A15:E15","v":"Arena-style Two-Court Module"},{"$f":"'Components and Space Standards'!B15:F15","v":1708.6168},{"$f":"'Components and Space Standards'!C15:G15","v":18392},{"$f":"'Components and Space Standards'!D15:G15","v":"Arena-style Two-Court Module(s)"},{"$f":"'Components and Space Standards'!E15:H15","v":"Provides space for arena-style seating for center, longitudinal ct."},0,0,{"$f":"F15*$C15","v":0},0,0,{"$f":"I15*$C15","v":0},0,0,{"$f":"L15*$C15","v":0},0,0,{"$f":"O15*$C15","v":0},0,0,{"$f":"R15*$C15","v":0},0,0,0]
[{"$f":"'Components and Space Standards'!A16:E16","v":"Additional Spectator seating"},{"$f":"'Components and Space Standards'!B16:F16","v":84.706219999999988},{"$f":"'Components and Space Standards'!C16:G16","v":911.8},{"$f":"'Components and Space Standards'!D16:G16","v":"Additional 200-seat Module(s)"},{"$f":"'Components and Space Standards'!E16:H16","v":"Four rows of seats (one ea. side) = 200 ppl."},0,0,{"$f":"F16*$C16","v":0},0,0,0,0,0,0,0,0,0,0,0,0,0,0,0]
[{"$f":"'Components and Space Standards'!A17:E17","v":"Basic storage/support"},{"$f":"'Components and Space Standards'!B17:F17","v":65.03},{"$f":"'Components and Space Standards'!C17:G17","v":700},{"$f":"'Components and Space Standards'!D17:G17","v":"Storage Module(s)"},{"$f":"'Components and Space Standards'!E17:H17","v":"Roughly 8% of base gym area"},0,0,0,1,65.03,700,2,130.06,1400,3,195.09,2100,4,260.12,2800,5,325.14999999999998,3500]
[{"$f":"'Components and Space Standards'!A18:E18","v":"Additional court storage"},{"$f":"'Components and Space Standards'!B18:F18","v":32.515000000000001},{"$f":"'Components and Space Standards'!C18:G18","v":350},{"$f":"'Components and Space Standards'!D18:G18","v":"Additional storage module(s)"},{"$f":"'Components and Space Standards'!E18:H18","v":"Storage space per additional court"},0,0,0,0,0,0,0,0,0,0,0,0,0,0,0,0,0,0]
[{"$f":"'Components and Space Standards'!A19:E19","v":"Unit PT/Group Exercise"}]
[{"$f":"'Components and Space Standards'!A20:E20","v":"Partitionable Room(s)"},{"$f":"'Components and Space Standards'!B20:F20","v":4.6449999999999996},{"$f":"'Components and Space Standards'!C20:G20","v":50},{"$f":"'Components and Space Standards'!D20:G20","v":"people at 4.6 m2 (50 ft.2)/person"},{"$f":"'Components and Space Standards'!E20:H20","v":"116.1 m2 (1,250 ft.2) (25 ppl) minimum size"},0,0,{"$f":"F20*$C20","v":0},25,116.12499999999999,{"$f":"I20*$C20","v":1250},25,116.12499999999999,{"$f":"L20*$C20","v":1250},50,232.24999999999997,{"$f":"O20*$C20","v":2500},50,232.24999999999997,{"$f":"R20*$C20","v":2500},75,348.37499999999994,{"$f":"U20*$C20","v":3750},"1250 = min. Navy, AF, MC / 2500 = min Army"]
[{"$f":"'Components and Space Standards'!A21:E21","v":"Storage/support"},{"$f":"'Components and Space Standards'!B21:F21","v":0.46449999999999997},{"$f":"'Components and Space Standards'!C21:G21","v":5},{"$f":"'Components and Space Standards'!D21:G21","v":"10% of partitionable room area"},{"$f":"'Components and Space Standards'!E21:H21","v":"11.6 m2 (125 ft.2) minimum (10% of room area)"},{"$f":"F20","v":0},0,{"$f":"F21*$C21","v":0},{"$f":"I20","v":25},11.612499999999999,{"$f":"I21*$C21","v":125},{"$f":"L20","v":25},11.612499999999999,{"$f":"L21*$C21","v":125},{"$f":"O20","v":50},23.224999999999998,{"$f":"O21*$C21","v":250},{"$f":"R20","v":50},23.224999999999998,{"$f":"R21*$C21","v":250},75,34.837499999999999,{"$f":"U21*$C21","v":375}]
[{"$f":"'Components and Space Standards'!A22:E22","v":"Fitness Spaces"}]
[{"$f":"'Components and Space Standards'!A23:E23","v":"Stretching"},{"$f":"'Components and Space Standards'!B23:F23","v":4.6449999999999996},{"$f":"'Components and Space Standards'!C23:G23","v":50},{"$f":"'Components and Space Standards'!D23:G23","v":"people at 4.6 m2 (50 ft.2)/person"},{"$f":"'Components and Space Standards'!E23:H23","v":"50 sf per person - min. 2 ppl"},3,{"$f":"$B23*F23","v":13.934999999999999},{"$f":"F23*$C23","v":150},3,{"$f":"$B23*I23","v":13.934999999999999},{"$f":"I23*$C23","v":150},6,{"$f":"$B23*L23","v":27.869999999999997},{"$f":"L23*$C23","v":300},8,{"$f":"$B23*O23","v":37.159999999999997},{"$f":"O23*$C23","v":400},12,{"$f":"$B23*R23","v":55.739999999999995},{"$f":"R23*$C23","v":600},12,{"$f":"$B23*U23","v":55.739999999999995},{"$f":"U23*$C23","v":600},"See Fitness Space sheet and exist. docs for these numbers"]
[{"$f":"'Components and Space Standards'!A24:E24","v":"Cardiovascular Equipment"},{"$f":"'Components and Space Standards'!B24:F24","v":4.6449999999999996},{"$f":"'Components and Space Standards'!C24:G24","v":50},{"$f":"'Components and Space Standards'!D24:G24","v":"items at 4.6 m2 (50 ft.2)/item"},{"$f":"'Components and Space Standards'!E24:H24","v":"50 sf per station"},20,{"$f":"$B24*F24","v":92.899999999999991},{"$f":"F24*$C24","v":1000},35,{"$f":"$B24*I24","v":162.57499999999999},{"$f":"I24*$C24","v":1750},64,{"$f":"$B24*L24","v":297.27999999999997},{"$f":"L24*$C24","v":3200},80,{"$f":"$B24*O24","v":371.59999999999997},{"$f":"O24*$C24","v":4000},125,{"$f":"$B24*R24","v":580.625},{"$f":"R24*$C24","v":6250},150,{"$f":"$B24*U24","v":696.74999999999989},{"$f":"U24*$C24","v":7500}]
[{"$f":"'Components and Space Standards'!A25:E25","v":"Selectorized (machine) weights"},{"$f":"'Components and Space Standards'!B25:F25","v":4.6449999999999996},{"$f":"'Components and Space Standards'!C25:G25","v":50},{"$f":"'Components and Space Standards'!D25:G25","v":"items at 4.6 m2 (50 ft.2)/item"},{"$f":"'Components and Space Standards'!E25:H25","v":"50 sf per station"},10,{"$f":"$B25*F25","v":46.449999999999996},{"$f":"F25*$C25","v":500},18,{"$f":"$B25*I25","v":83.609999999999985},{"$f":"I25*$C25","v":900},18,{"$f":"$B25*L25","v":83.609999999999985},{"$f":"L25*$C25","v":900},36,{"$f":"$B25*O25","v":167.21999999999997},{"$f":"O25*$C25","v":1800},36,{"$f":"$B25*R25","v":167.21999999999997},{"$f":"R25*$C25","v":1800},54,{"$f":"$B25*U25","v":250.82999999999998},{"$f":"U25*$C25","v":2700}]
[{"$f":"'Components and Space Standards'!A26:E26","v":"Free/Plate-loaded weights"},{"$f":"'Components and Space Standards'!B26:F26","v":6.0385},{"$f":"'Components and Space Standards'!C26:G26","v":65},{"$f":"'Components and Space Standards'!D26:G26","v":"stations at 6.0 m2 (65 ft.2)/stations"},{"$f":"'Components and Space Standards'!E26:H26","v":"65 sf per station"},15,{"$f":"$B26*F26","v":90.577500000000001},{"$f":"F26*$C26","v":975},15,{"$f":"$B26*I26","v":90.577500000000001},{"$f":"I26*$C26","v":975},30,{"$f":"$B26*L26","v":181.155},{"$f":"L26*$C26","v":1950},30,{"$f":"$B26*O26","v":181.155},{"$f":"O26*$C26","v":1950},45,{"$f":"$B26*R26","v":271.73250000000002},{"$f":"R26*$C26","v":2925},45,{"$f":"$B26*U26","v":271.73250000000002},{"$f":"U26*$C26","v":2925}]
[{"$f":"'Components and Space Standards'!A27:E27","v":"Finess Program Manager's Office"},{"$f":"'Components and Space Standards'!B27:F27","v":11.612499999999999},{"$f":"'Components and Space Standards'!C27:G27","v":125},{"$f":"'Components and Space Standards'!D27:G27","v":"Office"},{"$f":"'Components and Space Standards'!E27:H27","v":"Private office that may include fitness testing equipment"}]
[{"$f":"'Components and Space Standards'!A28:E28","v":"Fitness Assessment Room"},{"$f":"'Components and Space Standards'!B28:F28","v":11.612499999999999},{"$f":"'Components and Space Standards'!C28:G28","v":125},{"$f":"'Components and Space Standards'!D28:G28","v":"Office(s)"},{"$f":"'Components and Space Standards'!E28:H28","v":"1 piece fitness equip for testing, computer desk, chairs, stretching"},1,{"$f":"$B28*F28","v":11.612499999999999},{"$f":"F28*$C28","v":125},1,{"$f":"$B28*I28","v":11.612499999999999},{"$f":"I28*$C28","v":125},1,{"$f":"$B28*L28","v":11.612499999999999},{"$f":"L28*$C28","v":125},1,{"$f":"$B28*O28","v":11.612499999999999},{"$f":"O28*$C28","v":125},1,{"$f":"$B28*R28","v":11.612499999999999},{"$f":"R28*$C28","v":125},1,{"$f":"$B28*U28","v":11.612499999999999},{"$f":"U28*$C28","v":125}]
[{"$f":"'Components and Space Standards'!A29:E29","v":"Structured Activities"}]
[{"$f":"'Components and Space Standards'!A30:E30","v":"Structured Activity Space"},{"$f":"'Components and Space Standards'!B30:F30","v":74.319999999999993},{"$f":"'Components and Space Standards'!C30:G30","v":800},{"$f":"'Components and Space Standards'!D30:G30","v":"Flexible space Module(s)"},{"$f":"'Components and Space Standards'!E30:H30","v":"Based on size of a single racquetball court"},1,{"$f":"$B30*F30","v":74.319999999999993},{"$f":"F30*$C30","v":800},2,{"$f":"$B30*I30","v":148.63999999999999},{"$f":"I30*$C30","v":1600},2,{"$f":"$B30*L30","v":148.63999999999999},{"$f":"L30*$C30","v":1600},3,{"$f":"$B30*O30","v":222.95999999999998},{"$f":"O30*$C30","v":2400},3,{"$f":"$B30*R30","v":222.95999999999998},{"$f":"R30*$C30","v":2400},3,{"$f":"$B30*U30","v":222.95999999999998},{"$f":"U30*$C30","v":2400},"equip. based"]
[{"$f":"'Components and Space Standards'!A31:E31","v":"Racquetball Courts"},{"$f":"'Components and Space Standards'!B31:F31","v":74.319999999999993},{"$f":"'Components and Space Standards'!C31:G31","v":800},{"$f":"'Components and Space Standards'!D31:G31","v":"Racquetball Court(s)"},{"$f":"'Components and Space Standards'!E31:H31","v":"Single court size. Minimum of two courts"},1,{"$f":"$B31*F31","v":74.319999999999993},{"$f":"F31*$C31","v":800},2,{"$f":"$B31*I31","v":148.63999999999999},{"$f":"I31*$C31","v":1600},4,{"$f":"$B31*L31","v":297.27999999999997},{"$f":"L31*$C31","v":3200},4,{"$f":"$B31*O31","v":297.27999999999997},{"$f":"O31*$C31","v":3200},6,{"$f":"$B31*R31","v":445.91999999999996},{"$f":"R31*$C31","v":4800},8,{"$f":"$B31*U31","v":594.55999999999995},{"$f":"U31*$C31","v":6400}]
[{"$f":"'Components and Space Standards'!A34:E34","v":"Spectator/officiating (MC Option)"},{"$f":"'Components and Space Standards'!B34:F34","v":18.579999999999998},{"$f":"'Components and Space Standards'!C34:G34","v":200},{"$f":"'Components and Space Standards'!D34:G34","v":"Spectator/officiating Module(s)"},{"$f":"'Components and Space Standards'!E34:H34","v":"Two rows of 10 seats for one ct. Max of two cts (400 sf)"},0,{"$f":"$B32*F32","v":0},{"$f":"F32*$C32","v":0},0,{"$f":"$B32*I32","v":0},{"$f":"I32*$C32","v":0},0,{"$f":"$B32*L32","v":0},{"$f":"L32*$C32","v":0},0,{"$f":"$B32*O32","v":0},{"$f":"O32*$C32","v":0},0,{"$f":"$B32*R32","v":0},{"$f":"R32*$C32","v":0},0,{"$f":"$B32*U32","v":0},{"$f":"U32*$C32","v":0}]
[{"$f":"'Components and Space Standards'!A35:E35","v":"Structured activity storage"},{"$f":"'Components and Space Standards'!B35:F35","v":7.4319999999999995},{"$f":"'Components and Space Standards'!C35:G35","v":80},{"$f":"'Components and Space Standards'!D35:G35","v":"10% of Structured Activity Space"},{"$f":"'Components and Space Standards'!E35:H35","v":"Based on Structured activity space (10% of room area)"}]
[{"$f":"'Components and Space Standards'!A36:E36","v":"Locker Rooms"},null,null,null,null,null,null,null,null,null,null,null,null,null,null,null,null,null,null,null,null,null,null,"Apply male/female split on occupant load, then calculate individual male and female locker areas from the split number."]
[{"$f":"'Components and Space Standards'!A37:E37","v":"Men's Locker Room"},{"$f":"'Components and Space Standards'!B37:F37","v":0},{"$f":"'Components and Space Standards'!C37:G37","v":0},{"$f":"'Components and Space Standards'!D37:G37","v":0},{"$f":"'Components and Space Standards'!E37:H37","v":0},null,{"$f":"$B35*F35","v":0},{"$f":"F35*$C35","v":0},null,{"$f":"$B35*I35","v":0},{"$f":"I35*$C35","v":0},null,{"$f":"$B35*L35","v":0},{"$f":"L35*$C35","v":0},null,{"$f":"$B35*O35","v":0},{"$f":"O35*$C35","v":0},null,{"$f":"$B35*R35","v":0},{"$f":"R35*$C35","v":0},null,{"$f":"$B35*U35","v":0},{"$f":"U35*$C35","v":0}]
[{"$f":"'Components and Space Standards'!A38:E38","v":"Locker/changing area"},{"$f":"'Components and Space Standards'!B38:F38","v":0.74319999999999997},{"$f":"'Components and Space Standards'!C38:G38","v":8},{"$f":"'Components and Space Standards'!D38:G38","v":"Lockers"},{"$f":"'Components and Space Standards'!E38:H38","v":"Per slot (2 double lockers or 1 single locker)"},null,0,0,null,0,0,null,0,0,null,0,0,null,0,0,null,0,0,"Ratios: 1 to 1 (all full), 66% (1 full per 2 dbls -  or 3 ppl / 2 slots), 50% (all double lockers) - Environmental adjust factor ----- "]
[{"$f":"'Components and Space Standards'!A39:E39","v":"Shower/drying area"},{"$f":"'Components and Space Standards'!B39:F39","v":2.7869999999999999},{"$f":"'Components and Space Standards'!C39:G39","v":30},{"$f":"'Components and Space Standards'!D39:G39","v":"Showers"},{"$f":"'Components and Space Standards'!E39:H39","v":"Per shower & integral drying area at 22 lockers/shower"},null,0,0,null,0,0,null,0,0,null,0,0,null,0,0,null,0,0]
[{"$f":"'Components and Space Standards'!A40:E40","v":"Toilet area"},{"$f":"'Components and Space Standards'!B40:F40","v":4.1804999999999994},{"$f":"'Components and Space Standards'!C40:G40","v":45},{"$f":"'Components and Space Standards'!D40:G40","v":"Water closets/lavatory modules"},{"$f":"'Components and Space Standards'!E40:H40","v":"Per wc and lav. at 30 lockers per wc/lav"},null,0,0,null,0,0,null,0,0,null,0,0,null,0,0,null,0,0,"Will confirm that 30 lockers per wc/lav is the correct formula"]
[{"$f":"'Components and Space Standards'!A41:E41","v":"Women's Locker Room"},{"$f":"'Components and Space Standards'!B41:F41","v":0},{"$f":"'Components and Space Standards'!C41:G41","v":0},{"$f":"'Components and Space Standards'!D41:G41","v":0},{"$f":"'Components and Space Standards'!E41:H41","v":0},null,0,0,null,0,0,null,0,0,null,0,0,null,0,0,null,0,0]
[{"$f":"'Components and Space Standards'!A42:E42","v":"Locker/changing area"},{"$f":"'Components and Space Standards'!B42:F42","v":0.74319999999999997},{"$f":"'Components and Space Standards'!C42:G42","v":8},{"$f":"'Components and Space Standards'!D42:G42","v":"Lockers"},{"$f":"'Components and Space Standards'!E42:H42","v":"Per slot (2 double lockers or 1 single locker)"},null,0,0,null,0,0,null,0,0,null,0,0,null,0,0,null,0,0]
[{"$f":"'Components and Space Standards'!A43:E43","v":"Shower/drying area"},{"$f":"'Components and Space Standards'!B43:F43","v":2.7869999999999999},{"$f":"'Components and Space Standards'!C43:G43","v":30},{"$f":"'Components and Space Standards'!D43:G43","v":"Showers"},{"$f":"'Components and Space Standards'!E43:H43","v":"Per shower & integral drying area at 22 lockers/shower"},null,0,0,null,0,0,null,0,0,null,0,0,null,0,0,null,0,0]
[{"$f":"'Components and Space Standards'!A44:E44","v":"Toilet area"},{"$f":"'Components and Space Standards'!B44:F44","v":4.1804999999999994},{"$f":"'Components and Space Standards'!C44:G44","v":45},{"$f":"'Components and Space Standards'!D44:G44","v":"Water closets/lavatory modules"},{"$f":"'Components and Space Standards'!E44:H44","v":"per wc and lav. at 20 lockers per wc/lav"},null,0,0,null,0,0,null,0,0,null,0,0,null,0,0,null,0,0,"Will confirm that 20 lockers per wc/lav is the correct formula"]
[{"$f":"'Components and Space Standards'!A45:E45","v":"Sauna, cool-down area"},{"$f":"'Components and Space Standards'!B45:F45","v":0},{"$f":"'Components and Space Standards'!C45:G45","v":0},{"$f":"'Components and Space Standards'!D45:G45","v":"M/F (2) Saunas/cool-down area"},{"$f":"'Components and Space Standards'!E45:H45","v":"small = 6 ppl, med = 8-9, lg = 12 ppl (+ cool down space)"},null,null,null,"Small",null,null,"Medium",null,null,"Large",null,null,"Large",null,null,"Large",null,null,"Not included in Navy facilities"]
[{"$f":"'Components and Space Standards'!A46:E46","v":"Steam Room, cool-down area"},{"$f":"'Components and Space Standards'!B46:F46","v":0},{"$f":"'Components and Space Standards'!C46:G46","v":0},{"$f":"'Components and Space Standards'!D46:G46","v":"M/F (2) Steam Rooms/cool-down area"},{"$f":"'Components and Space Standards'!E46:H46","v":"small = 6-7 ppl, med = 8-9, lg = 12-14 (+ cool down space)"},null,null,null,"Small",null,null,"Medium",null,null,"Large",null,null,"Large",null,null,"Large",null,null,"Not included in Navy facilities"]
[{"$f":"'Components and Space Standards'!A47:E47","v":"Hot Tub"},{"$f":"'Components and Space Standards'!B47:F47","v":0},{"$f":"'Components and Space Standards'!C47:G47","v":0},{"$f":"'Components and Space Standards'!D47:G47","v":"Unisex Hot Tub"},{"$f":"'Components and Space Standards'!E47:H47","v":"small = 5 ppl, med = 8, lg = 12-14 ppl"},null,null,null,"Small",null,null,"Medium",null,null,"Large",null,null,"Large",null,null,"Large",null,null,"Not included in Navy facilities"]
[{"$f":"'Components and Space Standards'!A48:E48","v":"Support Areas"}]
[{"$f":"'Components and Space Standards'!A49:E49","v":"Laundry"},{"$f":"'Components and Space Standards'!B49:F49","v":18.579999999999998},{"$f":"'Components and Space Standards'!C49:G49","v":200},{"$f":"'Components and Space Standards'!D49:G49","v":"Laundry Room"},{"$f":"'Components and Space Standards'!E49:H49","v":"Per one-washer/two-dryer room"},"1/2 machine combo",null,null,"1/2 machine combo",null,null,"2/4 machine combo",null,null,"3/6 machine combo",null,null,"4/8 machine combo",null,null,"5/10 machine combo",null,null,"One washer, two dryers, commercial equip, folding table, sink, storage shelves, laundry carts, and opt. ice machine."]
[{"$f":"'Components and Space Standards'!A50:E50","v":"Equipment repair and receiving"},{"$f":"'Components and Space Standards'!B50:F50","v":0},{"$f":"'Components and Space Standards'!C50","v":0},{"$f":"'Components and Space Standards'!D50:G50","v":"Repair/receiving Room"},{"$f":"'Components and Space Standards'!E50:H50","v":"Fixed receiving area + variable repair (10% of Fitness)"},null,null,null,null,null,null,null,null,null,null,null,null,null,null,null,null,null,null,"10% of total Fitness (Army) / 250 sf (AF)"]
[{"$f":"'Components and Space Standards'!A51:E51","v":"Storage"},{"$f":"'Components and Space Standards'!B51:F51","v":0},{"$f":"'Components and Space Standards'!C51","v":0},{"$f":"'Components and Space Standards'!D51:G51","v":"Storage Room"},{"$f":"'Components and Space Standards'!E51:H51","v":"Variable lockable storage room (5% of fitness)"}]
[{"$f":"'Components and Space Standards'!A52:E52","v":"Additional Programmatic Storage"},{"$f":"'Components and Space Standards'!B52:F52","v":0},{"$f":"'Components and Space Standards'!C52","v":0},{"$f":"'Components and Space Standards'!D52:G52","v":" sf  Additional Storage"},{"$f":"'Components and Space Standards'!E52:H52","v":"To be filled-in by programmer and justified based on item stored."}]
[{"$f":"'Components and Space Standards'!A53:E53","v":"Janitor's Closet(s)"},{"$f":"'Components and Space Standards'!B53:F53","v":3.7159999999999997},{"$f":"'Components and Space Standards'!C53","v":40},{"$f":"'Components and Space Standards'!D53:G53","v":"40 SF/closet"},{"$f":"'Components and Space Standards'!E53:H53","v":"Per Janitor's Closet"},2,{"$f":"$B51*F51","v":7.4319999999999995},{"$f":"F51*$C51","v":80},2,{"$f":"$B51*I51","v":7.4319999999999995},{"$f":"I51*$C51","v":80},3,{"$f":"$B51*L51","v":11.148},{"$f":"L51*$C51","v":120},4,{"$f":"$B51*O51","v":14.863999999999999},{"$f":"O51*$C51","v":160},4,{"$f":"$B51*R51","v":14.863999999999999},{"$f":"R51*$C51","v":160},4,{"$f":"$B51*U51","v":14.863999999999999},{"$f":"U51*$C51","v":160}]
[{"$f":"'Components and Space Standards'!A54:E54","v":"Health Promotion Spaces - Marine Corps Only (Required or Optional)"},{"$f":"'Components and Space Standards'!B54:F54","v":0},{"$f":"'Components and Space Standards'!C54:G54","v":0},null,{"$f":"'Components and Space Standards'!E54:H54","v":0}]
[{"$f":"'Components and Space Standards'!A55:E55","v":"Lobby/Reception"},{"$f":"'Components and Space Standards'!B55:F55","v":27.869999999999997},{"$f":"'Components and Space Standards'!C55:G55","v":300},{"$f":"'Components and Space Standards'!D55:G55","v":"Lobby/Reception Module(s)"},{"$f":"'Components and Space Standards'!E55:H55","v":"per area"},0,{"$f":"$B53*F53","v":0},{"$f":"F53*$C53","v":0},0,{"$f":"$B53*I53","v":0},{"$f":"I53*$C53","v":0},0,{"$f":"$B53*L53","v":0},{"$f":"L53*$C53","v":0},0,{"$f":"$B53*O53","v":0},{"$f":"O53*$C53","v":0},0,{"$f":"$B53*R53","v":0},{"$f":"R53*$C53","v":0},0,{"$f":"$B53*U53","v":0},{"$f":"U53*$C53","v":0},"From AF"]
[{"$f":"'Components and Space Standards'!A56:E56","v":"Director's Office"},{"$f":"'Components and Space Standards'!B56:F56","v":11.148},{"$f":"'Components and Space Standards'!C56:G56","v":120},{"$f":"'Components and Space Standards'!D56:G56","v":"Office"},{"$f":"'Components and Space Standards'!E56:H56","v":"per office"},0,0,0,0,0,0,0,0,0,0,0,0,0,0,0,0,0,0,"AF office area = 400 sf total"]
[{"$f":"'Components and Space Standards'!A57:E57","v":"Program Managers' Offices"},{"$f":"'Components and Space Standards'!B57:F57","v":9.2899999999999991},{"$f":"'Components and Space Standards'!C57:G57","v":100},{"$f":"'Components and Space Standards'!D57:G57","v":"Office(s)"},{"$f":"'Components and Space Standards'!E57:H57","v":"per office"},0,0,0,0,0,0,0,0,0,0,0,0,0,0,0,0,0,0]
[{"$f":"'Components and Space Standards'!A58:E58","v":"Support Staff Workstations"},{"$f":"'Components and Space Standards'!B58:F58","v":5.9455999999999998},{"$f":"'Components and Space Standards'!C58:G58","v":64},{"$f":"'Components and Space Standards'!D58:G58","v":"Workstation(s)"},{"$f":"'Components and Space Standards'!E58:H58","v":"per workstation"},0,0,0,0,0,0,0,0,0,0,0,0,0,0,0,0,0,0]
[{"$f":"'Components and Space Standards'!A59:E59","v":"Classrooms/Training rooms"},{"$f":"'Components and Space Standards'!B59:F59","v":58.527000000000001},{"$f":"'Components and Space Standards'!C59:G59","v":630},{"$f":"'Components and Space Standards'!D59:G59","v":"Classroom/Training Module(s)"},{"$f":"'Components and Space Standards'!E59:H59","v":"per room"},0,0,0,0,0,0,0,0,0,0,0,0,0,0,0,0,0,0,"From AF"]
[{"$f":"'Components and Space Standards'!A60:E60","v":"Resource Room/Computer Lab"},{"$f":"'Components and Space Standards'!B60:F60","v":23.224999999999998},{"$f":"'Components and Space Standards'!C60:G60","v":250},{"$f":"'Components and Space Standards'!D60:G60","v":"Resource/Computer Lab Module(s)"},{"$f":"'Components and Space Standards'!E60:H60","v":"per room"},0,0,0,0,0,0,0,0,0,0,0,0,0,0,0,0,0,0,"From AF - combines comp lab with resource library"]
[{"$f":"'Components and Space Standards'!A61:E61","v":"Storage/support"},{"$f":"'Components and Space Standards'!B61:F61","v":7.4319999999999995},{"$f":"'Components and Space Standards'!C61:G61","v":80},{"$f":"'Components and Space Standards'!D61:G61","v":"Storage/support Module(s)"},{"$f":"'Components and Space Standards'!E61:H61","v":"per area"},0,0,0,0,0,0,0,0,0,0,0,0,0,0,0,0,0,0]
[{"$f":"'Components and Space Standards'!A63:E63","v":"Ergometry and Fitness Testing *"},{"$f":"'Components and Space Standards'!B63:F63","v":7.4319999999999995},{"$f":"'Components and Space Standards'!C63:G63","v":80},{"$f":"'Components and Space Standards'!D63:G63","v":"Testing Cubicle(s)"},{"$f":"'Components and Space Standards'!E63:H63","v":"per testing cubicles"},0,0,0,0,0,0,0,0,0,0,0,0,0,0,0,0,0,0,"From AF - cubicles go in an enclosed room (need circulation beteen cubicles--doesn't seem to be accounted for in AF criteria?)"]
[{"$f":"'Components and Space Standards'!A64:E64","v":"Wellness Assessment *"},{"$f":"'Components and Space Standards'!B64:F64","v":13.934999999999999},{"$f":"'Components and Space Standards'!C64:G64","v":150},{"$f":"'Components and Space Standards'!D64:G64","v":"Assessment Room(s)"},{"$f":"'Components and Space Standards'!E64:H64","v":"per room"},0,0,0,0,0,0,0,0,0,0,0,0,0,0,0,0,0,0,"From AF"]
[{"$f":"'Components and Space Standards'!A65:E65","v":"Administrative Spaces (required or optional)"},{"$f":"'Components and Space Standards'!B65:F65","v":0},{"$f":"'Components and Space Standards'!C65:G65","v":0},null,{"$f":"'Components and Space Standards'!E65:H65","v":0}]
[{"$f":"'Components and Space Standards'!A66:E66","v":"Director's Office"},{"$f":"'Components and Space Standards'!B66:F66","v":11.148},{"$f":"'Components and Space Standards'!C66:G66","v":120},{"$f":"'Components and Space Standards'!D66:G66","v":"Office"},{"$f":"'Components and Space Standards'!E66:H66","v":"per office"},1,{"$f":"$B63*F63","v":11.148},{"$f":"F63*$C63","v":120},1,{"$f":"$B63*I63","v":11.148},{"$f":"I63*$C63","v":120},1,{"$f":"$B63*L63","v":11.148},{"$f":"L63*$C63","v":120},1,{"$f":"$B63*O63","v":11.148},{"$f":"O63*$C63","v":120},1,{"$f":"$B63*R63","v":11.148},{"$f":"R63*$C63","v":120},1,{"$f":"$B63*U63","v":11.148},{"$f":"U63*$C63","v":120},"req."]
[{"$f":"'Components and Space Standards'!A67:E67","v":"Program Managers' Offices"},{"$f":"'Components and Space Standards'!B67:F67","v":9.2899999999999991},{"$f":"'Components and Space Standards'!C67:G67","v":100},{"$f":"'Components and Space Standards'!D67:G67","v":"Office(s)"},{"$f":"'Components and Space Standards'!E67:H67","v":"per office"},1,9.2899999999999991,100,1,9.2899999999999991,100,1,9.2899999999999991,100,1,9.2899999999999991,100,1,9.2899999999999991,100,1,9.2899999999999991,100,"optional (req. AF)"]
[{"$f":"'Components and Space Standards'!A68:E68","v":"Support Staff Workstations"},{"$f":"'Components and Space Standards'!B68:F68","v":5.9455999999999998},{"$f":"'Components and Space Standards'!C68:G68","v":64},{"$f":"'Components and Space Standards'!D68:G68","v":"Workstation(s)"},{"$f":"'Components and Space Standards'!E68:H68","v":"per office"},0,0,0,1,5.9455999999999998,64,2,11.8912,128,3,17.8368,192,4,23.782399999999999,256,5,29.727999999999998,320,"optional (req. AF)"]
[{"$f":"'Components and Space Standards'!A69:E69","v":"Copy/file/work/break Room"},{"$f":"'Components and Space Standards'!B69:F69","v":7.4319999999999995},{"$f":"'Components and Space Standards'!C69:G69","v":80},{"$f":"'Components and Space Standards'!D69:G69","v":"Workroom Module(s)"},{"$f":"'Components and Space Standards'!E69:H69","v":"per room"},1,7.4319999999999995,80,1,7.4319999999999995,80,2,14.863999999999999,160,2,14.863999999999999,160,2,14.863999999999999,160,3,22.295999999999999,240,"req."]
[{"$f":"'Components and Space Standards'!A70:E70","v":"Classroom/Training Room"},{"$f":"'Components and Space Standards'!B70:F70","v":69.674999999999997},{"$f":"'Components and Space Standards'!C70:G70","v":750},{"$f":"'Components and Space Standards'!D70:G70","v":"25-person Module at 750 SF"},{"$f":"'Components and Space Standards'!E70:H70","v":"1,500 SF Med/Lge & 2,250 SF for Xtra Lge/Jumbo"},1,69.674999999999997,750,1,69.674999999999997,750,2,139.35,1500,2,139.35,1500,3,209.02499999999998,2250,3,209.02499999999998,2250,"Req. Program space"]
[{"$f":"'Components and Space Standards'!A71:E71","v":"Classroom/Training Storage"},{"$f":"'Components and Space Standards'!B71:F71","v":5.5739999999999998},{"$f":"'Components and Space Standards'!C71:G71","v":60},{"$f":"'Components and Space Standards'!D71:G71","v":"Storage Module(s)"},{"$f":"'Components and Space Standards'!E71:H71","v":"per 25-person Training Room"},1,5.5739999999999998,60,1,5.5739999999999998,60,2,11.148,120,2,11.148,120,3,16.722000000000001,180,3,16.722000000000001,180]
[{"$f":"'Components and Space Standards'!A72:E72","v":"Optional or Service-specific Program Spaces"},{"$f":"'Components and Space Standards'!B72:F72","v":0},{"$f":"'Components and Space Standards'!C72:G72","v":0},null,{"$f":"'Components and Space Standards'!E72:H72","v":0}]
[{"$f":"'Components and Space Standards'!A75:E75","v":"Indoor Track"}]
[{"$f":"'Components and Space Standards'!A76:E76","v":"Indoor Track"}]
[{"$f":"'Components and Space Standards'!A77:E77","v":"1/14th-mile Indoor Track"},{"$f":"'Components and Space Standards'!B77:F77","v":310.00729999999999},{"$f":"'Components and Space Standards'!C77:G77","v":3337},{"$f":"'Components and Space Standards'!D77:G77","v":"1/14th-mile, 2-lane Indoor Track "},{"$f":"'Components and Space Standards'!E77:H77","v":"1/14th-mile, 2-lane Indoor Track (754 linear ft.)"},0,{"$f":"$B72*F72","v":0},{"$f":"F72*$C72","v":0},0,{"$f":"$B72*I72","v":0},{"$f":"I72*$C72","v":0},0,{"$f":"$B72*L72","v":0},{"$f":"L72*$C72","v":0},null,{"$f":"$B72*O72","v":0},{"$f":"O72*$C72","v":0},0,{"$f":"$B72*R72","v":0},{"$f":"R72*$C72","v":0},null,{"$f":"$B72*U72","v":0},{"$f":"U72*$C72","v":0},"(smallest gym option, Army and Navy only)"]
[{"$f":"'Components and Space Standards'!A78:E78","v":"1/12th-mile Indoor Track"},{"$f":"'Components and Space Standards'!B78:F78","v":523.02699999999993},{"$f":"'Components and Space Standards'!C78:G78","v":5630},{"$f":"'Components and Space Standards'!D78:G78","v":"1/12th-mile, 3-lane Indoor Track"},{"$f":"'Components and Space Standards'!E78:H78","v":"1/12th-mile, 3-lane Indoor Track (1284 linear ft.)"}]
[{"$f":"'Components and Space Standards'!A79:E79","v":"1/11th-mile Indoor Track"},{"$f":"'Components and Space Standards'!B79:F79","v":556.74969999999996},{"$f":"'Components and Space Standards'!C79:G79","v":5993},{"$f":"'Components and Space Standards'!D79:G79","v":"1/11th-mile, 3-lane Indoor Track "},{"$f":"'Components and Space Standards'!E79:H79","v":"1/11th-mile, 3-lane Indoor Track (1440 linear ft.)"},0,0,0,0,0,0,0,0,0,0,0,0,0,0,0,null,0,0]
[{"$f":"'Components and Space Standards'!A80:E80","v":"1/8th-mile Indoor Track"},{"$f":"'Components and Space Standards'!B80:F80","v":989.10629999999992},{"$f":"'Components and Space Standards'!C80:G80","v":10647},{"$f":"'Components and Space Standards'!D80:G80","v":"1/8th-mile, 4-lane Indoor Track "},{"$f":"'Components and Space Standards'!E80:H80","v":"1/8th-mile, 4-lane Indoor Track (2640 linear ft.)"},0,0,0,0,0,0,0,0,0,0,0,0,0,0,0,0,0,0]
[{"$f":"'Components and Space Standards'!A81:E81","v":"Indoor track lobby"},{"$f":"'Components and Space Standards'!B81:F81","v":13.377599999999999},{"$f":"'Components and Space Standards'!C81:G81","v":144},{"$f":"'Components and Space Standards'!D81:G81","v":"Indoor track lobby(ies)"},{"$f":"'Components and Space Standards'!E81:H81","v":"Access point to lobby from stair/elevator"},1,13.377599999999999,144,2,26.755199999999999,288,2,26.755199999999999,288,2,26.755199999999999,288,2,26.755199999999999,288,2,26.755199999999999,288]
[{"$f":"'Components and Space Standards'!A82:E82","v":"Additional Group Exercise Room"},{"$f":"'Components and Space Standards'!B82:F82","v":116.125},{"$f":"'Components and Space Standards'!C82:G82","v":1250},{"$f":"'Components and Space Standards'!D82:G82","v":"Additional Group Exercise Room"},{"$f":"'Components and Space Standards'!E82:H82","v":"per room"},0,0,0,0,0,0,0,0,0,0,0,0,0,0,0,null,0,0,"Optional catch-up space"]
[{"$f":"'Components and Space Standards'!A83:E83","v":"Massage Room"},{"$f":"'Components and Space Standards'!B83:F83","v":11.148},{"$f":"'Components and Space Standards'!C83:G83","v":120},{"$f":"'Components and Space Standards'!D83:G83","v":"Massage Room(s)"},{"$f":"'Components and Space Standards'!E83:H83","v":"per room"},0,0,0,0,0,0,0,0,0,0,0,0,0,0,0,null,0,0]
[{"$f":"'Components and Space Standards'!A84:E84","v":"Physical Therapy Training"},{"$f":"'Components and Space Standards'!B84:F84","v":11.612499999999999},{"$f":"'Components and Space Standards'!C84:G84","v":125},{"$f":"'Components and Space Standards'!D84:G84","v":"Physical Therapy Training Room(s)"},{"$f":"'Components and Space Standards'!E84:H84","v":"per room"},0,0,0,0,0,0,0,0,0,0,0,0,0,0,0,null,0,0,"similar to fitness assement"]
[{"$f":"'Components and Space Standards'!A85:E85","v":"Expanded Retail 1"},{"$f":"'Components and Space Standards'!B85:F85","v":9.2899999999999991},{"$f":"'Components and Space Standards'!C85:G85","v":100},{"$f":"'Components and Space Standards'!D85:G85","v":"Expanded Retail Module(s)"},{"$f":"'Components and Space Standards'!E85:H85","v":"per area"},0,0,0,0,0,0,0,0,0,0,0,0,0,0,0,null,0,0,"dry good, sports equip, clothes, etc. Usually contractor and sep from control"]
[{"$f":"'Components and Space Standards'!A86:E86","v":"Expanded Juice Bar 1"},{"$f":"'Components and Space Standards'!B86:F86","v":13.934999999999999},{"$f":"'Components and Space Standards'!C86:G86","v":150},{"$f":"'Components and Space Standards'!D86:G86","v":"Expanded Juice Bar Module(s)"},{"$f":"'Components and Space Standards'!E86:H86","v":"per area"},0,0,0,0,0,0,0,0,0,0,0,0,0,0,0,null,0,0,"Additional food/beverage counter. Usually contractor and sep from control"]
[{"$f":"'Components and Space Standards'!A87:E87","v":"Expanded Juice Bar Seating"},{"$f":"'Components and Space Standards'!B87:F87","v":13.934999999999999},{"$f":"'Components and Space Standards'!C87:G87","v":150},{"$f":"'Components and Space Standards'!D87:G87","v":"Two-table seating Module(s)"},{"$f":"'Components and Space Standards'!E87:H87","v":"Two 4-top tables and seating area"},0,0,0,0,0,0,0,0,0,0,0,0,0,0,0,null,0,0]
[{"$f":"'Components and Space Standards'!A88:E88","v":"Family Changing Room"},{"$f":"'Components and Space Standards'!B88:F88","v":10.218999999999999},{"$f":"'Components and Space Standards'!C88:G88","v":110},{"$f":"'Components and Space Standards'!D88:G88","v":"Family Changing Room(s)"},{"$f":"'Components and Space Standards'!E88:H88","v":"per shower, wc, lav, changing, and locker"},1,10.218999999999999,110,2,20.437999999999999,220,3,30.656999999999996,330,4,40.875999999999998,440,5,51.094999999999999,550,5,51.094999999999999,550,"Indiv. locker area for parent & child (grows by adding showers and changing stalls plus lockers)"]
[{"$f":"'Components and Space Standards'!A89:E89","v":"Convertible Locker Space"},{"$f":"'Components and Space Standards'!B89:F89","v":69.674999999999997},{"$f":"'Components and Space Standards'!C89:G89","v":750},{"$f":"'Components and Space Standards'!D89:G89","v":"Add'l male or female space"},{"$f":"'Components and Space Standards'!E89:H89","v":"750 sf"},0,0,0,0,0,0,0,0,0,0,0,0,0,0,0,null,0,0,"AF-only option. Calculate how many people this accomodates"]
[{"$f":"'Components and Space Standards'!A90:E90","v":"Female DV Locker Room *"},{"$f":"'Components and Space Standards'!B90:F90","v":23.224999999999998},{"$f":"'Components and Space Standards'!C90:G90","v":250},{"$f":"'Components and Space Standards'!D90:G90","v":"Female DV Locker Room"},{"$f":"'Components and Space Standards'!E90:H90","v":"250, 500, 750"},0,0,0,0,0,0,0,0,0,0,0,0,0,0,0,null,0,0]
[{"$f":"'Components and Space Standards'!A91:E91","v":"Child Play Area/Parent Child Area *"},{"$f":"'Components and Space Standards'!B91:F91","v":74.319999999999993},{"$f":"'Components and Space Standards'!C91:G91","v":800},{"$f":"'Components and Space Standards'!D91:G91","v":"Parent/child Module(s)"},{"$f":"'Components and Space Standards'!E91:H91","v":"400 sf play area (at 35 sf/child), 400 sf equip (50 sf/equip)"},1,74.319999999999993,800,1,74.319999999999993,800,1,74.319999999999993,800,1,74.319999999999993,800,1,74.319999999999993,800,1,74.319999999999993,800]
[{"$f":"'Components and Space Standards'!A92:E92","v":"HAWC Demonstration Kitchen"},{"$f":"'Components and Space Standards'!B92:F92","v":46.449999999999996},{"$f":"'Components and Space Standards'!C92:G92","v":500},{"$f":"'Components and Space Standards'!D92:G92","v":"Kitchen Module(s)"},{"$f":"'Components and Space Standards'!E92:H92","v":"per kitchen"},0,0,0,0,0,0,0,0,0,0,0,0,0,0,0,null,0,0,"From AF"]
[{"$f":"'Components and Space Standards'!A93:E93","v":"HAWC Relaxation Room *"},{"$f":"'Components and Space Standards'!B93:F93","v":9.2899999999999991},{"$f":"'Components and Space Standards'!C93:G93","v":100},{"$f":"'Components and Space Standards'!D93:G93","v":"Relaxation Room(s)"},{"$f":"'Components and Space Standards'!E93:H93","v":"per room"},0,0,0,0,0,0,0,0,0,0,0,0,0,0,0,null,0,0,"From AF"]
[{"$f":"'Components and Space Standards'!A94:E94","v":"Site Spaces"}]
[{"$f":"'Components and Space Standards'!A95:E95","v":"Staff Parking"},{"$f":"'Components and Space Standards'!B95:F95","v":41.805},{"$f":"'Components and Space Standards'!C95:G95","v":450},{"$f":"'Components and Space Standards'!D95:G95","v":"Parking Spaces"},{"$f":"'Components and Space Standards'!E95:H95","v":"per space (including circulation)"},6,{"$f":"F90*B90","v":250.82999999999998},{"$f":"F90*C90","v":2700},6,{"$f":"$B90*I90","v":250.82999999999998},{"$f":"I90*$C90","v":2700},6,{"$f":"$B90*L90","v":250.82999999999998},{"$f":"L90*$C90","v":2700},6,{"$f":"$B90*O90","v":250.82999999999998},{"$f":"O90*$C90","v":2700},10,{"$f":"$B90*R90","v":418.05},{"$f":"R90*$C90","v":4500},15,{"$f":"$B90*U90","v":627.07500000000005},{"$f":"U90*$C90","v":6750}]
[{"$f":"'Components and Space Standards'!A96:E96","v":"Loading dock"},{"$f":"'Components and Space Standards'!B96:F96","v":8.3609999999999989},{"$f":"'Components and Space Standards'!C96:G96","v":90},{"$f":"'Components and Space Standards'!D96:G96","v":"Loading Dock"},{"$f":"'Components and Space Standards'!E96:H96","v":"Per single-truck dock"},1,8.3609999999999989,90,1,8.3609999999999989,90,1,8.3609999999999989,90,1,8.3609999999999989,90,1,8.3609999999999989,90,1,8.3609999999999989,90]
[{"$f":"'Components and Space Standards'!A97:E97","v":"Service Drive/trash"},{"$f":"'Components and Space Standards'!B97:F97","v":69.674999999999997},{"$f":"'Components and Space Standards'!C97:G97","v":750},{"$f":"'Components and Space Standards'!D97:G97","v":"Service Drive Module"},{"$f":"'Components and Space Standards'!E97:H97","v":"per area"},1,69.674999999999997,750,1,69.674999999999997,750,1,69.674999999999997,750,1,69.674999999999997,750,1,69.674999999999997,750,1,69.674999999999997,750]
[{"$f":"'Components and Space Standards'!A98:E98","v":"Customer Parking"},{"$f":"'Components and Space Standards'!B98:F98","v":41.805},{"$f":"'Components and Space Standards'!C98:G98","v":450},{"$f":"'Components and Space Standards'!D98:G98","v":"Parking Spaces"},{"$f":"'Components and Space Standards'!E98:H98","v":"per space (including circulation)"},92,3846.06,41400,147,6145.335,66150,215,8988.0750000000007,96750,298,12457.89,134100,400,16722,180000,500,20902.5,225000]
[{"$f":"'Components and Space Standards'!A99:E99","v":"Bicycle Rack Area"},{"$f":"'Components and Space Standards'!B99:F99","v":14.863999999999999},{"$f":"'Components and Space Standards'!C99:G99","v":160},{"$f":"'Components and Space Standards'!D99:G99","v":"10-bike Rack(s)"},{"$f":"'Components and Space Standards'!E99:H99","v":"per 10-bike Rack"},1,14.863999999999999,160,1,14.863999999999999,160,1,14.863999999999999,160,1,14.863999999999999,160,2,29.727999999999998,320,2,29.727999999999998,320]
[{"$f":"'Components and Space Standards'!A100:E100","v":"Patio"},{"$f":"'Components and Space Standards'!B100:F100","v":2.3224999999999998},{"$f":"'Components and Space Standards'!C100:G100","v":25},{"$f":"'Components and Space Standards'!D100:G100","v":"Patio Module(s)"},{"$f":"'Components and Space Standards'!E100:H100","v":"per patio"},0,0,0,0,0,0,0,0,0,0,0,0,0,0,0,0,0,0]
[{"$f":"'Components and Space Standards'!A101:E101","v":"* Service-specific space."}]
[{"$f":"'Components and Space Standards'!A102:E102","v":"1 If contract service, verify area with contractor. "}]

{"sheet":"AF","index":5,"n_rows":95,"n_cols":18,"rows_kept":95,"cut":false,"hidden":true,"merged":[[0,17,1,17],[0,14,0,16],[0,5,0,7],[0,1,0,4],[0,8,0,10],[0,11,0,13],[2,0,2,4],[81,17,82,17],[22,17,27,17],[12,17,15,17],[33,17,34,17],[47,17,48,17],[65,17,66,17],[67,0,67,4],[50,0,50,4],[60,0,60,4]]}
["Col. A - D refer to \"Components & Space Standards\" Sheet.","Space Allocation Standard",null,null,null,"Small",null,null,"Medium",null,null,"Large",null,null,"Each Additional 1K",null,null,"Notes"]
["Functional Component","m2","ft.2","Standard","Description","No.","m2","ft.2","No.","m2","ft.2","No.","m2","ft.2","No.","m2","ft.2"]
[{"$f":"'Components and Space Standards'!A3:E3","v":"Fitness Spaces"}]
[{"$f":"'Components and Space Standards'!A4","v":"Lobby/Reception"}]
[{"$f":"'Components and Space Standards'!A5","v":"Entry Lobby"},{"$f":"'Components and Space Standards'!B5","v":9.2899999999999991},{"$f":"'Components and Space Standards'!C5","v":100},{"$f":"'Components and Space Standards'!D5","v":"Vestibule/Lobby Module(s) (for 2-3 ppl)"},{"$f":"'Components and Space Standards'!E5","v":"Vesibule and/or space for 2 to 3 ppl to queue"},1,{"$f":"$B5*F5","v":9.2899999999999991},{"$f":"F5*$C5","v":100},2,{"$f":"$B5*I5","v":18.579999999999998},{"$f":"I5*$C5","v":200},3,{"$f":"$B5*L5","v":27.869999999999997},{"$f":"L5*$C5","v":300},null,{"$f":"$B5*O5","v":0},{"$f":"O5*$C5","v":0},"between bldg entrance and control"]
[{"$f":"'Components and Space Standards'!A6","v":"Control Counter"},{"$f":"'Components and Space Standards'!B6","v":11.612499999999999},{"$f":"'Components and Space Standards'!C6","v":125},{"$f":"'Components and Space Standards'!D6","v":"Counter Module(s)"},{"$f":"'Components and Space Standards'!E6","v":"Space for counter, space behind, space in front"},2,23.224999999999998,{"$f":"F6*$C6","v":250},null,{"$f":"$B6*I6","v":0},{"$f":"I6*$C6","v":0},2,{"$f":"$B6*L6","v":23.224999999999998},{"$f":"L6*$C6","v":250},null,{"$f":"$B6*O6","v":0},{"$f":"O6*$C6","v":0},"Includes minor retail items"]
[{"$f":"'Components and Space Standards'!A7","v":"Equipment issue storage"},{"$f":"'Components and Space Standards'!B7","v":16.2575},{"$f":"'Components and Space Standards'!C7","v":175},{"$f":"'Components and Space Standards'!D7","v":"Storage Module(s)"},{"$f":"'Components and Space Standards'!E7","v":"Equipment storage at/behind gear issue "},1,16.2575,{"$f":"F7*$C7","v":175},null,{"$f":"$B7*I7","v":0},{"$f":"I7*$C7","v":0},1,{"$f":"$B7*L7","v":16.2575},{"$f":"L7*$C7","v":175},null,{"$f":"$B7*O7","v":0},{"$f":"O7*$C7","v":0},"2 units min. for Navy. Others get 1 unit in smallest"]
[{"$f":"'Components and Space Standards'!A8","v":"Vending"},{"$f":"'Components and Space Standards'!B8","v":1.8579999999999999},{"$f":"'Components and Space Standards'!C8","v":20},{"$f":"'Components and Space Standards'!D8","v":"Vending Machine(s)"},{"$f":"'Components and Space Standards'!E8","v":"per vending machine"},2,3.7159999999999997,{"$f":"F8*$C8","v":40},null,{"$f":"$B8*I8","v":0},{"$f":"I8*$C8","v":0},4,{"$f":"$B8*L8","v":7.4319999999999995},{"$f":"L8*$C8","v":80},null,{"$f":"$B8*O8","v":0},{"$f":"O8*$C8","v":0},"2 for small"]
[{"$f":"'Components and Space Standards'!A9","v":"Waiting/Display"},{"$f":"'Components and Space Standards'!B9","v":8.3609999999999989},{"$f":"'Components and Space Standards'!C9","v":90},{"$f":"'Components and Space Standards'!D9","v":"Seating/Display Module(s) (for 4 ppl)"},{"$f":"'Components and Space Standards'!E9","v":"Space for seating for 4 ppl and display area"},6,50.165999999999997,{"$f":"F9*$C9","v":540},null,{"$f":"$B9*I9","v":0},{"$f":"I9*$C9","v":0},12,{"$f":"$B9*L9","v":100.33199999999999},{"$f":"L9*$C9","v":1080},null,{"$f":"$B9*O9","v":0},{"$f":"O9*$C9","v":0},"Waiting area adjacent to lobby and in front of control. Grows in units of 90"]
[{"$f":"'Components and Space Standards'!A10","v":"Spectator peak-time circulation"},{"$f":"'Components and Space Standards'!B10","v":27.869999999999997},{"$f":"'Components and Space Standards'!C10","v":300},{"$f":"'Components and Space Standards'!D10","v":"Circulation Module(s)"},{"$f":"'Components and Space Standards'!E10","v":"Per one-side bleachers - driven by gym size"},0,0,null,null,null,null,null,null,null,null,null,null,"Optional, 300 sf for 1 set bleachers, Additional circulation space for peak gym loads"]
[{"$f":"'Components and Space Standards'!A11","v":"Public restrooms/phones"},{"$f":"'Components and Space Standards'!B11","v":0},{"$f":"'Components and Space Standards'!C11","v":0},{"$f":"'Components and Space Standards'!D11","v":"Public Restroom(s)"},{"$f":"'Components and Space Standards'!E11","v":"Option - Driven by gym size"},null,0,null,null,null,null,null,null,null,null,null,null,"1 (uni), 1/1, ?/?, 4/6 (limit option to those below the facility size) Largest gym size drives largest bathroom. AF limited to top three options."]
[{"$f":"'Components and Space Standards'!A12","v":"Gymnasium"}]
[{"$f":"'Components and Space Standards'!A13","v":"Basketball/volleyball Court"},{"$f":"'Components and Space Standards'!B13","v":826.06679999999994},{"$f":"'Components and Space Standards'!C13","v":8892},{"$f":"'Components and Space Standards'!D13","v":"One-court/200-seat Module(s)"},{"$f":"'Components and Space Standards'!E13","v":"NCAA Court + 10' safety + 200 seats (one side)"},1,{"$f":"$B13*F13","v":826.06679999999994},{"$f":"F13*$C13","v":8892},0,{"$f":"$B13*I13","v":0},{"$f":"I13*$C13","v":0},0,{"$f":"$B13*L13","v":0},{"$f":"L13*$C13","v":0},null,{"$f":"$B13*O13","v":0},{"$f":"O13*$C13","v":0},"Need both elements if indoor track is required."]
[{"$f":"'Components and Space Standards'!A14","v":"Two Court Module"},{"$f":"'Components and Space Standards'!B14","v":1630.9523999999999},{"$f":"'Components and Space Standards'!C14","v":17556},{"$f":"'Components and Space Standards'!D14","v":"Two-court/200-seat Module(s)"},{"$f":"'Components and Space Standards'!E14","v":"Two courts + 10' safety, 16' between cts, + 200 seats"},null,0,{"$f":"F14*$C14","v":0},1,1630.9523999999999,{"$f":"I14*$C14","v":17556},1,1630.9523999999999,{"$f":"L14*$C14","v":17556},null,0,{"$f":"O14*$C14","v":0}]
[{"$f":"'Components and Space Standards'!A15","v":"Arena-style Two-Court Module"},{"$f":"'Components and Space Standards'!B15","v":1708.6168},{"$f":"'Components and Space Standards'!C15","v":18392},{"$f":"'Components and Space Standards'!D15","v":"Arena-style Two-Court Module(s)"},{"$f":"'Components and Space Standards'!E15","v":"Provides space for arena-style seating for center, longitudinal ct."},null,0,{"$f":"F15*$C15","v":0},null,0,{"$f":"I15*$C15","v":0},null,0,{"$f":"L15*$C15","v":0},null,0,{"$f":"O15*$C15","v":0}]
[{"$f":"'Components and Space Standards'!A16","v":"Additional Spectator seating"},{"$f":"'Components and Space Standards'!B16","v":84.706219999999988},{"$f":"'Components and Space Standards'!C16","v":911.8},{"$f":"'Components and Space Standards'!D16","v":"Additional 200-seat Module(s)"},{"$f":"'Components and Space Standards'!E16","v":"Four rows of seats (one ea. side) = 200 ppl."},1,84.706219999999988,911.8,null,0,0,1,84.706219999999988,911.8,null,0,0]
[{"$f":"'Components and Space Standards'!A17","v":"Basic storage/support"},{"$f":"'Components and Space Standards'!B17","v":65.03},{"$f":"'Components and Space Standards'!C17","v":700},{"$f":"'Components and Space Standards'!D17","v":"Storage Module(s)"},{"$f":"'Components and Space Standards'!E17","v":"Roughly 8% of base gym area"},1,65.03,700,null,0,0,{"$f":"2-1","v":1},65.03,700,null,0,0]
[{"$f":"'Components and Space Standards'!A18","v":"Additional court storage"},{"$f":"'Components and Space Standards'!B18","v":32.515000000000001},{"$f":"'Components and Space Standards'!C18","v":350},{"$f":"'Components and Space Standards'!D18","v":"Additional storage module(s)"},{"$f":"'Components and Space Standards'!E18","v":"Storage space per additional court"},null,0,0,null,0,0,{"$f":"0+1","v":1},32.515000000000001,350,null,0,0]
[{"$f":"'Components and Space Standards'!A19","v":"Unit PT/Group Exercise"}]
[{"$f":"'Components and Space Standards'!A20","v":"Partitionable Room(s)"},{"$f":"'Components and Space Standards'!B20","v":4.6449999999999996},{"$f":"'Components and Space Standards'!C20","v":50},{"$f":"'Components and Space Standards'!D20","v":"people at 4.6 m2 (50 ft.2)/person"},{"$f":"'Components and Space Standards'!E20","v":"116.1 m2 (1,250 ft.2) (25 ppl) minimum size"},205,{"$f":"$B20*F20","v":952.22499999999991},{"$f":"F20*$C20","v":10250},300,{"$f":"$B20*I20","v":1393.4999999999998},{"$f":"I20*$C20","v":15000},400,{"$f":"$B20*L20","v":1857.9999999999998},{"$f":"L20*$C20","v":20000},null,{"$f":"$B20*O20","v":0},{"$f":"O20*$C20","v":0},"1250 = min. Navy, AF, MC / 2500 = min Army"]
[{"$f":"'Components and Space Standards'!A21","v":"Storage/support"},{"$f":"'Components and Space Standards'!B21","v":0.46449999999999997},{"$f":"'Components and Space Standards'!C21","v":5},{"$f":"'Components and Space Standards'!D21","v":"10% of partitionable room area"},{"$f":"'Components and Space Standards'!E21","v":"11.6 m2 (125 ft.2) minimum (10% of room area)"},{"$f":"F20","v":205},{"$f":"$B21*F21","v":95.222499999999997},{"$f":"F21*$C21","v":1025},{"$f":"I20","v":300},{"$f":"$B21*I21","v":139.35},{"$f":"I21*$C21","v":1500},{"$f":"L20","v":400},{"$f":"$B21*L21","v":185.79999999999998},{"$f":"L21*$C21","v":2000},null,{"$f":"$B21*O21","v":0},{"$f":"O21*$C21","v":0}]
[{"$f":"'Components and Space Standards'!A22","v":"Fitness Spaces"}]
[{"$f":"'Components and Space Standards'!A23","v":"Stretching"},{"$f":"'Components and Space Standards'!B23","v":4.6449999999999996},{"$f":"'Components and Space Standards'!C23","v":50},{"$f":"'Components and Space Standards'!D23","v":"people at 4.6 m2 (50 ft.2)/person"},{"$f":"'Components and Space Standards'!E23","v":"50 sf per person - min. 2 ppl"},2,{"$f":"$B23*F23","v":9.2899999999999991},{"$f":"F23*$C23","v":100},null,{"$f":"$B23*I23","v":0},{"$f":"I23*$C23","v":0},7,{"$f":"$B23*L23","v":32.515000000000001},{"$f":"L23*$C23","v":350},null,{"$f":"$B23*O23","v":0},{"$f":"O23*$C23","v":0},"See Fitness Space sheet and exist. docs for these numbers"]
[{"$f":"'Components and Space Standards'!A24","v":"Cardiovascular Equipment"},{"$f":"'Components and Space Standards'!B24","v":4.6449999999999996},{"$f":"'Components and Space Standards'!C24","v":50},{"$f":"'Components and Space Standards'!D24","v":"items at 4.6 m2 (50 ft.2)/item"},{"$f":"'Components and Space Standards'!E24","v":"50 sf per station"},10,{"$f":"$B24*F24","v":46.449999999999996},{"$f":"F24*$C24","v":500},null,{"$f":"$B24*I24","v":0},{"$f":"I24*$C24","v":0},50,{"$f":"$B24*L24","v":232.24999999999997},{"$f":"L24*$C24","v":2500},null,{"$f":"$B24*O24","v":0},{"$f":"O24*$C24","v":0}]
[{"$f":"'Components and Space Standards'!A25","v":"Selectorized (machine) weights"},{"$f":"'Components and Space Standards'!B25","v":4.6449999999999996},{"$f":"'Components and Space Standards'!C25","v":50},{"$f":"'Components and Space Standards'!D25","v":"items at 4.6 m2 (50 ft.2)/item"},{"$f":"'Components and Space Standards'!E25","v":"50 sf per station"},17,{"$f":"$B25*F25","v":78.964999999999989},{"$f":"F25*$C25","v":850},null,{"$f":"$B25*I25","v":0},{"$f":"I25*$C25","v":0},45,{"$f":"$B25*L25","v":209.02499999999998},{"$f":"L25*$C25","v":2250},null,{"$f":"$B25*O25","v":0},{"$f":"O25*$C25","v":0}]
[{"$f":"'Components and Space Standards'!A26","v":"Free/Plate-loaded weights"},{"$f":"'Components and Space Standards'!B26","v":6.0385},{"$f":"'Components and Space Standards'!C26","v":65},{"$f":"'Components and Space Standards'!D26","v":"stations at 6.0 m2 (65 ft.2)/stations"},{"$f":"'Components and Space Standards'!E26","v":"65 sf per station"},17,{"$f":"$B26*F26","v":102.6545},{"$f":"F26*$C26","v":1105},null,{"$f":"$B26*I26","v":0},{"$f":"I26*$C26","v":0},34,{"$f":"$B26*L26","v":205.309},{"$f":"L26*$C26","v":2210},null,{"$f":"$B26*O26","v":0},{"$f":"O26*$C26","v":0}]
[{"$f":"'Components and Space Standards'!A27","v":"Finess Program Manager's Office"},{"$f":"'Components and Space Standards'!B27","v":11.612499999999999},{"$f":"'Components and Space Standards'!C27","v":125},{"$f":"'Components and Space Standards'!D27","v":"Office"},{"$f":"'Components and Space Standards'!E27","v":"Private office that may include fitness testing equipment"}]
[{"$f":"'Components and Space Standards'!A28","v":"Fitness Assessment Room"},{"$f":"'Components and Space Standards'!B28","v":11.612499999999999},{"$f":"'Components and Space Standards'!C28","v":125},{"$f":"'Components and Space Standards'!D28","v":"Office(s)"},{"$f":"'Components and Space Standards'!E28","v":"1 piece fitness equip for testing, computer desk, chairs, stretching"},1,{"$f":"$B28*F28","v":11.612499999999999},{"$f":"F28*$C28","v":125},null,{"$f":"$B28*I28","v":0},{"$f":"I28*$C28","v":0},1,{"$f":"$B28*L28","v":11.612499999999999},{"$f":"L28*$C28","v":125},null,{"$f":"$B28*O28","v":0},{"$f":"O28*$C28","v":0}]
[{"$f":"'Components and Space Standards'!A29","v":"Structured Activities"}]
[{"$f":"'Components and Space Standards'!A30","v":"Structured Activity Space"},{"$f":"'Components and Space Standards'!B30","v":74.319999999999993},{"$f":"'Components and Space Standards'!C30","v":800},{"$f":"'Components and Space Standards'!D30","v":"Flexible space Module(s)"},{"$f":"'Components and Space Standards'!E30","v":"Based on size of a single racquetball court"},1,{"$f":"$B30*F30","v":74.319999999999993},{"$f":"F30*$C30","v":800},null,{"$f":"$B30*I30","v":0},{"$f":"I30*$C30","v":0},2,{"$f":"$B30*L30","v":148.63999999999999},{"$f":"L30*$C30","v":1600},null,{"$f":"$B30*O30","v":0},{"$f":"O30*$C30","v":0},"equip. based"]
[{"$f":"'Components and Space Standards'!A31","v":"Racquetball Courts"},{"$f":"'Components and Space Standards'!B31","v":74.319999999999993},{"$f":"'Components and Space Standards'!C31","v":800},{"$f":"'Components and Space Standards'!D31","v":"Racquetball Court(s)"},{"$f":"'Components and Space Standards'!E31","v":"Single court size. Minimum of two courts"},2,{"$f":"$B31*F31","v":148.63999999999999},{"$f":"F31*$C31","v":1600},null,{"$f":"$B31*I31","v":0},{"$f":"I31*$C31","v":0},4,{"$f":"$B31*L31","v":297.27999999999997},{"$f":"L31*$C31","v":3200},null,{"$f":"$B31*O31","v":0},{"$f":"O31*$C31","v":0}]
[{"$f":"'Components and Space Standards'!A34","v":"Spectator/officiating (MC Option)"},{"$f":"'Components and Space Standards'!B34","v":18.579999999999998},{"$f":"'Components and Space Standards'!C34","v":200},{"$f":"'Components and Space Standards'!D34","v":"Spectator/officiating Module(s)"},{"$f":"'Components and Space Standards'!E34","v":"Two rows of 10 seats for one ct. Max of two cts (400 sf)"},1,{"$f":"$B32*F32","v":18.579999999999998},{"$f":"F32*$C32","v":200},null,{"$f":"$B32*I32","v":0},{"$f":"I32*$C32","v":0},2,{"$f":"$B32*L32","v":37.159999999999997},{"$f":"L32*$C32","v":400},null,{"$f":"$B32*O32","v":0},{"$f":"O32*$C32","v":0}]
[{"$f":"'Components and Space Standards'!A35","v":"Structured activity storage"},{"$f":"'Components and Space Standards'!B35","v":7.4319999999999995},{"$f":"'Components and Space Standards'!C35","v":80},{"$f":"'Components and Space Standards'!D35","v":"10% of Structured Activity Space"},{"$f":"'Components and Space Standards'!E35","v":"Based on Structured activity space (10% of room area)"}]
[{"$f":"'Components and Space Standards'!A36","v":"Locker Rooms"},null,null,null,null,null,null,null,null,null,null,null,null,null,null,null,null,"Apply male/female split on occupant load, then calculate individual male and female locker areas from the split number."]
[{"$f":"'Components and Space Standards'!A37","v":"Men's Locker Room"},{"$f":"'Components and Space Standards'!B37","v":0},{"$f":"'Components and Space Standards'!C37","v":0},{"$f":"'Components and Space Standards'!D37","v":0},{"$f":"'Components and Space Standards'!E37","v":0},null,{"$f":"$B35*F35","v":0},{"$f":"F35*$C35","v":0},null,{"$f":"$B35*I35","v":0},{"$f":"I35*$C35","v":0},null,{"$f":"$B35*L35","v":0},{"$f":"L35*$C35","v":0},null,{"$f":"$B35*O35","v":0},{"$f":"O35*$C35","v":0}]
[{"$f":"'Components and Space Standards'!A38","v":"Locker/changing area"},{"$f":"'Components and Space Standards'!B38","v":0.74319999999999997},{"$f":"'Components and Space Standards'!C38","v":8},{"$f":"'Components and Space Standards'!D38","v":"Lockers"},{"$f":"'Components and Space Standards'!E38","v":"Per slot (2 double lockers or 1 single locker)"},175,130.06,1400,null,0,0,382,283.9024,3056,null,0,0,"Ratios: 1 to 1 (all full), 66% (1 full per 2 dbls -  or 3 ppl / 2 slots), 50% (all double lockers) - Environmental adjust factor ----- "]
[{"$f":"'Components and Space Standards'!A39","v":"Shower/drying area"},{"$f":"'Components and Space Standards'!B39","v":2.7869999999999999},{"$f":"'Components and Space Standards'!C39","v":30},{"$f":"'Components and Space Standards'!D39","v":"Showers"},{"$f":"'Components and Space Standards'!E39","v":"Per shower & integral drying area at 22 lockers/shower"},9,25.082999999999998,270,null,0,0,19,52.952999999999996,570,null,0,0]
[{"$f":"'Components and Space Standards'!A40","v":"Toilet area"},{"$f":"'Components and Space Standards'!B40","v":4.1804999999999994},{"$f":"'Components and Space Standards'!C40","v":45},{"$f":"'Components and Space Standards'!D40","v":"Water closets/lavatory modules"},{"$f":"'Components and Space Standards'!E40","v":"Per wc and lav. at 30 lockers per wc/lav"},6,25.082999999999998,270,null,0,0,13,54.346499999999992,585,null,0,0,"Will confirm that 30 lockers per wc/lav is the correct formula"]
[{"$f":"'Components and Space Standards'!A41","v":"Women's Locker Room"},{"$f":"'Components and Space Standards'!B41","v":0},{"$f":"'Components and Space Standards'!C41","v":0},{"$f":"'Components and Space Standards'!D41","v":0},{"$f":"'Components and Space Standards'!E41","v":0},null,0,0,null,0,0,null,0,0,null,0,0]
[{"$f":"'Components and Space Standards'!A42","v":"Locker/changing area"},{"$f":"'Components and Space Standards'!B42","v":0.74319999999999997},{"$f":"'Components and Space Standards'!C42","v":8},{"$f":"'Components and Space Standards'!D42","v":"Lockers"},{"$f":"'Components and Space Standards'!E42","v":"Per slot (2 double lockers or 1 single locker)"},143,106.27759999999999,1144,null,0,0,313,232.6216,2504,null,0,0]
[{"$f":"'Components and Space Standards'!A43","v":"Shower/drying area"},{"$f":"'Components and Space Standards'!B43","v":2.7869999999999999},{"$f":"'Components and Space Standards'!C43","v":30},{"$f":"'Components and Space Standards'!D43","v":"Showers"},{"$f":"'Components and Space Standards'!E43","v":"Per shower & integral drying area at 22 lockers/shower"},7,19.509,210,null,0,0,16,44.591999999999999,480,null,0,0]
[{"$f":"'Components and Space Standards'!A44","v":"Toilet area"},{"$f":"'Components and Space Standards'!B44","v":4.1804999999999994},{"$f":"'Components and Space Standards'!C44","v":45},{"$f":"'Components and Space Standards'!D44","v":"Water closets/lavatory modules"},{"$f":"'Components and Space Standards'!E44","v":"per wc and lav. at 20 lockers per wc/lav"},5,20.902499999999996,225,null,0,0,10,41.804999999999993,450,null,0,0,"Will confirm that 20 lockers per wc/lav is the correct formula"]
[{"$f":"'Components and Space Standards'!A45","v":"Sauna, cool-down area"},{"$f":"'Components and Space Standards'!B45","v":0},{"$f":"'Components and Space Standards'!C45","v":0},{"$f":"'Components and Space Standards'!D45","v":"M/F (2) Saunas/cool-down area"},{"$f":"'Components and Space Standards'!E45","v":"small = 6 ppl, med = 8-9, lg = 12 ppl (+ cool down space)"}]
[{"$f":"'Components and Space Standards'!A46","v":"Steam Room, cool-down area"},{"$f":"'Components and Space Standards'!B46","v":0},{"$f":"'Components and Space Standards'!C46","v":0},{"$f":"'Components and Space Standards'!D46","v":"M/F (2) Steam Rooms/cool-down area"},{"$f":"'Components and Space Standards'!E46","v":"small = 6-7 ppl, med = 8-9, lg = 12-14 (+ cool down space)"}]
[{"$f":"'Components and Space Standards'!A47","v":"Hot Tub"},{"$f":"'Components and Space Standards'!B47","v":0},{"$f":"'Components and Space Standards'!C47","v":0},{"$f":"'Components and Space Standards'!D47","v":"Unisex Hot Tub"},{"$f":"'Components and Space Standards'!E47","v":"small = 5 ppl, med = 8, lg = 12-14 ppl"}]
[{"$f":"'Components and Space Standards'!A48","v":"Support Areas"}]
[{"$f":"'Components and Space Standards'!A49","v":"Laundry"},{"$f":"'Components and Space Standards'!B49","v":18.579999999999998},{"$f":"'Components and Space Standards'!C49","v":200},{"$f":"'Components and Space Standards'!D49","v":"Laundry Room"},{"$f":"'Components and Space Standards'!E49","v":"Per one-washer/two-dryer room"},1,null,null,2,null,null,3,null,null,null,null,null,"One washer, two dryers, commercial equip, folding table, sink, storage shelves, laundry carts, and opt. ice machine."]
[{"$f":"'Components and Space Standards'!A50","v":"Equipment repair and receiving"},{"$f":"'Components and Space Standards'!B50","v":0},{"$f":"'Components and Space Standards'!C50","v":0},{"$f":"'Components and Space Standards'!D50","v":"Repair/receiving Room"},{"$f":"'Components and Space Standards'!E50","v":"Fixed receiving area + variable repair (10% of Fitness)"},null,null,null,null,null,null,null,null,null,null,null,null,"10% of total Fitness (Army) / 250 sf (AF)"]
[{"$f":"'Components and Space Standards'!A51","v":"Storage"},{"$f":"'Components and Space Standards'!B51","v":0},{"$f":"'Components and Space Standards'!C51","v":0},{"$f":"'Components and Space Standards'!D51","v":"Storage Room"},{"$f":"'Components and Space Standards'!E51","v":"Variable lockable storage room (5% of fitness)"}]
[{"$f":"'Components and Space Standards'!A52","v":"Additional Programmatic Storage"},{"$f":"'Components and Space Standards'!B52","v":0},{"$f":"'Components and Space Standards'!C52","v":0},{"$f":"'Components and Space Standards'!D52","v":" sf  Additional Storage"},{"$f":"'Components and Space Standards'!E52","v":"To be filled-in by programmer and justified based on item stored."}]
[{"$f":"'Components and Space Standards'!A54:E54","v":"Health Promotion Spaces - Marine Corps Only (Required or Optional)"}]
[{"$f":"'Components and Space Standards'!A55","v":"Lobby/Reception"},{"$f":"'Components and Space Standards'!B55","v":27.869999999999997},{"$f":"'Components and Space Standards'!C55","v":300},{"$f":"'Components and Space Standards'!D55","v":"Lobby/Reception Module(s)"},{"$f":"'Components and Space Standards'!E55","v":"per area"},1,{"$f":"$B52*F52","v":27.869999999999997},{"$f":"F52*$C52","v":300},1,{"$f":"$B52*I52","v":27.869999999999997},{"$f":"I52*$C52","v":300},1,{"$f":"$B52*L52","v":27.869999999999997},{"$f":"L52*$C52","v":300},null,{"$f":"$B52*O52","v":0},{"$f":"O52*$C52","v":0},"From AF"]
[{"$f":"'Components and Space Standards'!A56","v":"Director's Office"},{"$f":"'Components and Space Standards'!B56","v":11.148},{"$f":"'Components and Space Standards'!C56","v":120},{"$f":"'Components and Space Standards'!D56","v":"Office"},{"$f":"'Components and Space Standards'!E56","v":"per office"},1,11.148,120,1,11.148,120,1,11.148,120,null,0,0,"AF office area = 400 sf total"]
[{"$f":"'Components and Space Standards'!A57","v":"Program Managers' Offices"},{"$f":"'Components and Space Standards'!B57","v":9.2899999999999991},{"$f":"'Components and Space Standards'!C57","v":100},{"$f":"'Components and Space Standards'!D57","v":"Office(s)"},{"$f":"'Components and Space Standards'!E57","v":"per office"},3,27.869999999999997,300,4,37.159999999999997,400,6,55.739999999999995,600,null,0,0]
[{"$f":"'Components and Space Standards'!A58","v":"Support Staff Workstations"},{"$f":"'Components and Space Standards'!B58","v":5.9455999999999998},{"$f":"'Components and Space Standards'!C58","v":64},{"$f":"'Components and Space Standards'!D58","v":"Workstation(s)"},{"$f":"'Components and Space Standards'!E58","v":"per workstation"},1,5.9455999999999998,64,1,5.9455999999999998,64,1,5.9455999999999998,64,null,0,0]
[{"$f":"'Components and Space Standards'!A59","v":"Classrooms/Training rooms"},{"$f":"'Components and Space Standards'!B59","v":58.527000000000001},{"$f":"'Components and Space Standards'!C59","v":630},{"$f":"'Components and Space Standards'!D59","v":"Classroom/Training Module(s)"},{"$f":"'Components and Space Standards'!E59","v":"per room"},4,234.108,2520,4,234.108,2520,4,234.108,2520,null,0,0,"From AF"]
[{"$f":"'Components and Space Standards'!A60","v":"Resource Room/Computer Lab"},{"$f":"'Components and Space Standards'!B60","v":23.224999999999998},{"$f":"'Components and Space Standards'!C60","v":250},{"$f":"'Components and Space Standards'!D60","v":"Resource/Computer Lab Module(s)"},{"$f":"'Components and Space Standards'!E60","v":"per room"},0,0,0,0,0,0,0,0,0,null,0,0,"From AF - combines comp lab with resource library"]
[{"$f":"'Components and Space Standards'!A61","v":"Storage/support"},{"$f":"'Components and Space Standards'!B61","v":7.4319999999999995},{"$f":"'Components and Space Standards'!C61","v":80},{"$f":"'Components and Space Standards'!D61","v":"Storage/support Module(s)"},{"$f":"'Components and Space Standards'!E61","v":"per area"},1,7.4319999999999995,80,1,7.4319999999999995,80,2,14.863999999999999,160,null,0,0]
[{"$f":"'Components and Space Standards'!A63","v":"Ergometry and Fitness Testing *"},{"$f":"'Components and Space Standards'!B63","v":7.4319999999999995},{"$f":"'Components and Space Standards'!C63","v":80},{"$f":"'Components and Space Standards'!D63","v":"Testing Cubicle(s)"},{"$f":"'Components and Space Standards'!E63","v":"per testing cubicles"},1,7.4319999999999995,80,2,14.863999999999999,160,4,29.727999999999998,320,null,0,0,"From AF - cubicles go in an enclosed room (need circulation beteen cubicles--doesn't seem to be accounted for in AF criteria?)"]
[{"$f":"'Components and Space Standards'!A64","v":"Wellness Assessment *"},{"$f":"'Components and Space Standards'!B64","v":13.934999999999999},{"$f":"'Components and Space Standards'!C64","v":150},{"$f":"'Components and Space Standards'!D64","v":"Assessment Room(s)"},{"$f":"'Components and Space Standards'!E64","v":"per room"},1,13.934999999999999,150,1,13.934999999999999,150,1,13.934999999999999,150,null,0,0,"From AF"]
[{"$f":"'Components and Space Standards'!A65:E65","v":"Administrative Spaces (required or optional)"}]
[{"$f":"'Components and Space Standards'!A66","v":"Director's Office"},{"$f":"'Components and Space Standards'!B66","v":11.148},{"$f":"'Components and Space Standards'!C66","v":120},{"$f":"'Components and Space Standards'!D66","v":"Office"},{"$f":"'Components and Space Standards'!E66","v":"per office"},1,{"$f":"$B62*F62","v":11.148},{"$f":"F62*$C62","v":120},1,{"$f":"$B62*I62","v":11.148},{"$f":"I62*$C62","v":120},1,{"$f":"$B62*L62","v":11.148},{"$f":"L62*$C62","v":120},null,{"$f":"$B62*O62","v":0},{"$f":"O62*$C62","v":0},"req."]
[{"$f":"'Components and Space Standards'!A67","v":"Program Managers' Offices"},{"$f":"'Components and Space Standards'!B67","v":9.2899999999999991},{"$f":"'Components and Space Standards'!C67","v":100},{"$f":"'Components and Space Standards'!D67","v":"Office(s)"},{"$f":"'Components and Space Standards'!E67","v":"per office"},3,27.869999999999997,300,3,27.869999999999997,300,3,27.869999999999997,300,null,0,0,"optional (req. AF)"]
[{"$f":"'Components and Space Standards'!A68","v":"Support Staff Workstations"},{"$f":"'Components and Space Standards'!B68","v":5.9455999999999998},{"$f":"'Components and Space Standards'!C68","v":64},{"$f":"'Components and Space Standards'!D68","v":"Workstation(s)"},{"$f":"'Components and Space Standards'!E68","v":"per office"},4,23.782399999999999,256,5,29.727999999999998,320,7,41.619199999999999,448,null,0,0,"optional (req. AF)"]
[{"$f":"'Components and Space Standards'!A69","v":"Copy/file/work/break Room"},{"$f":"'Components and Space Standards'!B69","v":7.4319999999999995},{"$f":"'Components and Space Standards'!C69","v":80},{"$f":"'Components and Space Standards'!D69","v":"Workroom Module(s)"},{"$f":"'Components and Space Standards'!E69","v":"per room"},1,7.4319999999999995,80,1,7.4319999999999995,80,1,7.4319999999999995,80,null,0,0,"req."]
[{"$f":"'Components and Space Standards'!A70","v":"Classroom/Training Room"},{"$f":"'Components and Space Standards'!B70","v":69.674999999999997},{"$f":"'Components and Space Standards'!C70","v":750},{"$f":"'Components and Space Standards'!D70","v":"25-person Module at 750 SF"},{"$f":"'Components and Space Standards'!E70","v":"1,500 SF Med/Lge & 2,250 SF for Xtra Lge/Jumbo"},1.6,111.48,1200,1.7,118.44749999999999,1275,1.8,125.41499999999999,1350,null,0,0,"Req. Program space"]
[{"$f":"'Components and Space Standards'!A71","v":"Classroom/Training Storage"},{"$f":"'Components and Space Standards'!B71","v":5.5739999999999998},{"$f":"'Components and Space Standards'!C71","v":60},{"$f":"'Components and Space Standards'!D71","v":"Storage Module(s)"},{"$f":"'Components and Space Standards'!E71","v":"per 25-person Training Room"},2,11.148,120,3,16.722000000000001,180,4,22.295999999999999,240,null,0,0]
[{"$f":"'Components and Space Standards'!A72:E72","v":"Optional or Service-specific Program Spaces"}]
[{"$f":"'Components and Space Standards'!A75","v":"Indoor Track"}]
[{"$f":"'Components and Space Standards'!A76","v":"Indoor Track"}]
[{"$f":"'Components and Space Standards'!A77","v":"1/14th-mile Indoor Track"},{"$f":"'Components and Space Standards'!B77","v":310.00729999999999},{"$f":"'Components and Space Standards'!C77","v":3337},{"$f":"'Components and Space Standards'!D77","v":"1/14th-mile, 2-lane Indoor Track "},{"$f":"'Components and Space Standards'!E77","v":"1/14th-mile, 2-lane Indoor Track (754 linear ft.)"},null,{"$f":"$B71*F71","v":0},{"$f":"F71*$C71","v":0},null,{"$f":"$B71*I71","v":0},{"$f":"I71*$C71","v":0},null,{"$f":"$B71*L71","v":0},{"$f":"L71*$C71","v":0},null,{"$f":"$B71*O71","v":0},{"$f":"O71*$C71","v":0},"(smallest gym option, Army and Navy only)"]
[{"$f":"'Components and Space Standards'!A79","v":"1/11th-mile Indoor Track"},{"$f":"'Components and Space Standards'!B79","v":556.74969999999996},{"$f":"'Components and Space Standards'!C79","v":5993},{"$f":"'Components and Space Standards'!D79","v":"1/11th-mile, 3-lane Indoor Track "},{"$f":"'Components and Space Standards'!E79","v":"1/11th-mile, 3-lane Indoor Track (1440 linear ft.)"},null,0,0,null,0,0,null,0,0,null,0,0]
[{"$f":"'Components and Space Standards'!A80","v":"1/8th-mile Indoor Track"},{"$f":"'Components and Space Standards'!B80","v":989.10629999999992},{"$f":"'Components and Space Standards'!C80","v":10647},{"$f":"'Components and Space Standards'!D80","v":"1/8th-mile, 4-lane Indoor Track "},{"$f":"'Components and Space Standards'!E80","v":"1/8th-mile, 4-lane Indoor Track (2640 linear ft.)"},1,989.10629999999992,10647,1,989.10629999999992,10647,1,989.10629999999992,10647,null,0,0]
[{"$f":"'Components and Space Standards'!A81","v":"Indoor track lobby"},{"$f":"'Components and Space Standards'!B81","v":13.377599999999999},{"$f":"'Components and Space Standards'!C81","v":144},{"$f":"'Components and Space Standards'!D81","v":"Indoor track lobby(ies)"},{"$f":"'Components and Space Standards'!E81","v":"Access point to lobby from stair/elevator"},1,13.377599999999999,144,1,13.377599999999999,144,1,13.377599999999999,144,null,0,0]
[{"$f":"'Components and Space Standards'!A82","v":"Additional Group Exercise Room"},{"$f":"'Components and Space Standards'!B82","v":116.125},{"$f":"'Components and Space Standards'!C82","v":1250},{"$f":"'Components and Space Standards'!D82","v":"Additional Group Exercise Room"},{"$f":"'Components and Space Standards'!E82","v":"per room"},null,0,0,null,0,0,null,0,0,null,0,0,"Optional catch-up space"]
[{"$f":"'Components and Space Standards'!A83","v":"Massage Room"},{"$f":"'Components and Space Standards'!B83","v":11.148},{"$f":"'Components and Space Standards'!C83","v":120},{"$f":"'Components and Space Standards'!D83","v":"Massage Room(s)"},{"$f":"'Components and Space Standards'!E83","v":"per room"},null,0,0,null,0,0,null,0,0,null,0,0]
[{"$f":"'Components and Space Standards'!A84","v":"Physical Therapy Training"},{"$f":"'Components and Space Standards'!B84","v":11.612499999999999},{"$f":"'Components and Space Standards'!C84","v":125},{"$f":"'Components and Space Standards'!D84","v":"Physical Therapy Training Room(s)"},{"$f":"'Components and Space Standards'!E84","v":"per room"},null,0,0,null,0,0,null,0,0,null,0,0,"similar to fitness assement"]
[{"$f":"'Components and Space Standards'!A85","v":"Expanded Retail 1"},{"$f":"'Components and Space Standards'!B85","v":9.2899999999999991},{"$f":"'Components and Space Standards'!C85","v":100},{"$f":"'Components and Space Standards'!D85","v":"Expanded Retail Module(s)"},{"$f":"'Components and Space Standards'!E85","v":"per area"},null,0,0,null,0,0,null,0,0,null,0,0,"dry good, sports equip, clothes, etc. Usually contractor and sep from control"]
[{"$f":"'Components and Space Standards'!A86","v":"Expanded Juice Bar 1"},{"$f":"'Components and Space Standards'!B86","v":13.934999999999999},{"$f":"'Components and Space Standards'!C86","v":150},{"$f":"'Components and Space Standards'!D86","v":"Expanded Juice Bar Module(s)"},{"$f":"'Components and Space Standards'!E86","v":"per area"},null,0,0,null,0,0,null,0,0,null,0,0,"Additional food/beverage counter. Usually contractor and sep from control"]
[{"$f":"'Components and Space Standards'!A87","v":"Expanded Juice Bar Seating"},{"$f":"'Components and Space Standards'!B87","v":13.934999999999999},{"$f":"'Components and Space Standards'!C87","v":150},{"$f":"'Components and Space Standards'!D87","v":"Two-table seating Module(s)"},{"$f":"'Components and Space Standards'!E87","v":"Two 4-top tables and seating area"},null,0,0,null,0,0,null,0,0,null,0,0]
[{"$f":"'Components and Space Standards'!A88","v":"Family Changing Room"},{"$f":"'Components and Space Standards'!B88","v":10.218999999999999},{"$f":"'Components and Space Standards'!C88","v":110},{"$f":"'Components and Space Standards'!D88","v":"Family Changing Room(s)"},{"$f":"'Components and Space Standards'!E88","v":"per shower, wc, lav, changing, and locker"},null,0,0,null,0,0,null,0,0,null,0,0,"Indiv. locker area for parent & child (grows by adding showers and changing stalls plus lockers)"]
[{"$f":"'Components and Space Standards'!A89","v":"Convertible Locker Space"},{"$f":"'Components and Space Standards'!B89","v":69.674999999999997},{"$f":"'Components and Space Standards'!C89","v":750},{"$f":"'Components and Space Standards'!D89","v":"Add'l male or female space"},{"$f":"'Components and Space Standards'!E89","v":"750 sf"},1,69.674999999999997,750,null,0,0,1.5,104.51249999999999,1125,null,0,0,"AF-only option. Calculate how many people this accomodates"]
[{"$f":"'Components and Space Standards'!A90","v":"Female DV Locker Room *"},{"$f":"'Components and Space Standards'!B90","v":23.224999999999998},{"$f":"'Components and Space Standards'!C90","v":250},{"$f":"'Components and Space Standards'!D90","v":"Female DV Locker Room"},{"$f":"'Components and Space Standards'!E90","v":"250, 500, 750"},1,23.224999999999998,250,null,0,0,2,46.449999999999996,500,null,0,0]
[{"$f":"'Components and Space Standards'!A91","v":"Child Play Area/Parent Child Area *"},{"$f":"'Components and Space Standards'!B91","v":74.319999999999993},{"$f":"'Components and Space Standards'!C91","v":800},{"$f":"'Components and Space Standards'!D91","v":"Parent/child Module(s)"},{"$f":"'Components and Space Standards'!E91","v":"400 sf play area (at 35 sf/child), 400 sf equip (50 sf/equip)"},null,0,0,null,0,0,null,0,0,null,0,0]
[{"$f":"'Components and Space Standards'!A92","v":"HAWC Demonstration Kitchen"},{"$f":"'Components and Space Standards'!B92","v":46.449999999999996},{"$f":"'Components and Space Standards'!C92","v":500},{"$f":"'Components and Space Standards'!D92","v":"Kitchen Module(s)"},{"$f":"'Components and Space Standards'!E92","v":"per kitchen"},null,0,0,null,0,0,null,0,0,null,0,0,"From AF"]
[{"$f":"'Components and Space Standards'!A93","v":"HAWC Relaxation Room *"},{"$f":"'Components and Space Standards'!B93","v":9.2899999999999991},{"$f":"'Components and Space Standards'!C93","v":100},{"$f":"'Components and Space Standards'!D93","v":"Relaxation Room(s)"},{"$f":"'Components and Space Standards'!E93","v":"per room"},null,0,0,null,0,0,null,0,0,null,0,0,"From AF"]
[{"$f":"'Components and Space Standards'!A94:E94","v":"Site Spaces"}]
[{"$f":"'Components and Space Standards'!A95","v":"Staff Parking"},{"$f":"'Components and Space Standards'!B95","v":41.805},{"$f":"'Components and Space Standards'!C95","v":450},{"$f":"'Components and Space Standards'!D95","v":"Parking Spaces"},{"$f":"'Components and Space Standards'!E95","v":"per space (including circulation)"},null,{"$f":"F88*B88","v":0},{"$f":"F88*C88","v":0},null,{"$f":"$B88*I88","v":0},{"$f":"I88*$C88","v":0},null,{"$f":"$B88*L88","v":0},{"$f":"L88*$C88","v":0},null,{"$f":"$B88*O88","v":0},{"$f":"O88*$C88","v":0}]
[{"$f":"'Components and Space Standards'!A96","v":"Loading dock"},{"$f":"'Components and Space Standards'!B96","v":8.3609999999999989},{"$f":"'Components and Space Standards'!C96","v":90},{"$f":"'Components and Space Standards'!D96","v":"Loading Dock"},{"$f":"'Components and Space Standards'!E96","v":"Per single-truck dock"},null,0,0,null,0,0,null,0,0,null,0,0]
[{"$f":"'Components and Space Standards'!A97","v":"Service Drive/trash"},{"$f":"'Components and Space Standards'!B97","v":69.674999999999997},{"$f":"'Components and Space Standards'!C97","v":750},{"$f":"'Components and Space Standards'!D97","v":"Service Drive Module"},{"$f":"'Components and Space Standards'!E97","v":"per area"},null,0,0,null,0,0,null,0,0,null,0,0]
[{"$f":"'Components and Space Standards'!A98","v":"Customer Parking"},{"$f":"'Components and Space Standards'!B98","v":41.805},{"$f":"'Components and Space Standards'!C98","v":450},{"$f":"'Components and Space Standards'!D98","v":"Parking Spaces"},{"$f":"'Components and Space Standards'!E98","v":"per space (including circulation)"},null,0,0,null,0,0,null,0,0,null,0,0]
[{"$f":"'Components and Space Standards'!A99","v":"Bicycle Rack Area"},{"$f":"'Components and Space Standards'!B99","v":14.863999999999999},{"$f":"'Components and Space Standards'!C99","v":160},{"$f":"'Components and Space Standards'!D99","v":"10-bike Rack(s)"},{"$f":"'Components and Space Standards'!E99","v":"per 10-bike Rack"},null,0,0,null,0,0,null,0,0,null,0,0]
[{"$f":"'Components and Space Standards'!A100","v":"Patio"},{"$f":"'Components and Space Standards'!B100","v":2.3224999999999998},{"$f":"'Components and Space Standards'!C100","v":25},{"$f":"'Components and Space Standards'!D100","v":"Patio Module(s)"},{"$f":"'Components and Space Standards'!E100","v":"per patio"},null,0,0,null,0,0,null,0,0,null,0,0]
[{"$f":"'Components and Space Standards'!A101","v":"* Service-specific space."}]
[{"$f":"'Components and Space Standards'!A102","v":"1 If contract service, verify area with contractor. "}]

{"sheet":"MC","index":6,"n_rows":97,"n_cols":23,"rows_kept":97,"cut":false,"hidden":true,"merged":[[68,0,68,4],[51,0,51,4],[2,0,2,4],[61,0,61,4],[83,20,84,20],[22,20,27,20],[12,20,13,20],[33,20,34,20],[47,20,48,20],[66,20,67,20],[0,20,1,20],[0,17,0,19],[0,5,0,7],[0,1,0,4],[0,8,0,10],[0,11,0,13],[0,14,0,16]]}
["Col. A - D refer to \"Components & Space Standards\" Sheet.","Space Allocation Standard",null,null,null,"Extra Small",null,null,"Small",null,null,"Medium",null,null,"Large",null,null,"Extra Large",null,null,"Notes"]
["Functional Component","m2","ft.2","Standard","Description","No.","m2","ft.2","No.","m2","ft.2","No.","m2","ft.2","No.","m2","ft.2","No.","m2","ft.2"]
[{"$f":"'Components and Space Standards'!A3:E3","v":"Fitness Spaces"}]
[{"$f":"'Components and Space Standards'!A4","v":"Lobby/Reception"}]
[{"$f":"'Components and Space Standards'!A5","v":"Entry Lobby"},{"$f":"'Components and Space Standards'!B5","v":9.2899999999999991},{"$f":"'Components and Space Standards'!C5","v":100},{"$f":"'Components and Space Standards'!D5","v":"Vestibule/Lobby Module(s) (for 2-3 ppl)"},{"$f":"'Components and Space Standards'!E5","v":"Vesibule and/or space for 2 to 3 ppl to queue"},1,{"$f":"$B5*F5","v":9.2899999999999991},{"$f":"F5*$C5","v":100},2,{"$f":"$B5*I5","v":18.579999999999998},{"$f":"I5*$C5","v":200},3,{"$f":"$B5*L5","v":27.869999999999997},{"$f":"L5*$C5","v":300},4,{"$f":"$B5*O5","v":37.159999999999997},{"$f":"O5*$C5","v":400},null,{"$f":"$B5*R5","v":0},{"$f":"R5*$C5","v":0},"between bldg entrance and control"]
[{"$f":"'Components and Space Standards'!A6","v":"Control Counter"},{"$f":"'Components and Space Standards'!B6","v":11.612499999999999},{"$f":"'Components and Space Standards'!C6","v":125},{"$f":"'Components and Space Standards'!D6","v":"Counter Module(s)"},{"$f":"'Components and Space Standards'!E6","v":"Space for counter, space behind, space in front"},1,{"$f":"$B6*F6","v":11.612499999999999},{"$f":"F6*$C6","v":125},2,{"$f":"$B6*I6","v":23.224999999999998},{"$f":"I6*$C6","v":250},3,{"$f":"$B6*L6","v":34.837499999999999},{"$f":"L6*$C6","v":375},4,{"$f":"$B6*O6","v":46.449999999999996},{"$f":"O6*$C6","v":500},null,{"$f":"$B6*R6","v":0},{"$f":"R6*$C6","v":0},"Includes minor retail items"]
[{"$f":"'Components and Space Standards'!A7","v":"Equipment issue storage"},{"$f":"'Components and Space Standards'!B7","v":16.2575},{"$f":"'Components and Space Standards'!C7","v":175},{"$f":"'Components and Space Standards'!D7","v":"Storage Module(s)"},{"$f":"'Components and Space Standards'!E7","v":"Equipment storage at/behind gear issue "},1,{"$f":"$B7*F7","v":16.2575},{"$f":"F7*$C7","v":175},2,{"$f":"$B7*I7","v":32.515000000000001},{"$f":"I7*$C7","v":350},3,{"$f":"$B7*L7","v":48.772500000000001},{"$f":"L7*$C7","v":525},4,{"$f":"$B7*O7","v":65.03},{"$f":"O7*$C7","v":700},null,{"$f":"$B7*R7","v":0},{"$f":"R7*$C7","v":0},"2 units min. for Navy. Others get 1 unit in smallest"]
[{"$f":"'Components and Space Standards'!A8","v":"Vending"},{"$f":"'Components and Space Standards'!B8","v":1.8579999999999999},{"$f":"'Components and Space Standards'!C8","v":20},{"$f":"'Components and Space Standards'!D8","v":"Vending Machine(s)"},{"$f":"'Components and Space Standards'!E8","v":"per vending machine"},2,{"$f":"$B8*F8","v":3.7159999999999997},{"$f":"F8*$C8","v":40},2,{"$f":"$B8*I8","v":3.7159999999999997},{"$f":"I8*$C8","v":40},4,{"$f":"$B8*L8","v":7.4319999999999995},{"$f":"L8*$C8","v":80},6,{"$f":"$B8*O8","v":11.148},{"$f":"O8*$C8","v":120},null,{"$f":"$B8*R8","v":0},{"$f":"R8*$C8","v":0},"2 for small"]
[{"$f":"'Components and Space Standards'!A9","v":"Waiting/Display"},{"$f":"'Components and Space Standards'!B9","v":8.3609999999999989},{"$f":"'Components and Space Standards'!C9","v":90},{"$f":"'Components and Space Standards'!D9","v":"Seating/Display Module(s) (for 4 ppl)"},{"$f":"'Components and Space Standards'!E9","v":"Space for seating for 4 ppl and display area"},1,{"$f":"$B9*F9","v":8.3609999999999989},{"$f":"F9*$C9","v":90},2,{"$f":"$B9*I9","v":16.721999999999998},{"$f":"I9*$C9","v":180},4,{"$f":"$B9*L9","v":33.443999999999996},{"$f":"L9*$C9","v":360},6,{"$f":"$B9*O9","v":50.165999999999997},{"$f":"O9*$C9","v":540},null,{"$f":"$B9*R9","v":0},{"$f":"R9*$C9","v":0},"Waiting area adjacent to lobby and in front of control. Grows in units of 90"]
[{"$f":"'Components and Space Standards'!A10","v":"Spectator peak-time circulation"},{"$f":"'Components and Space Standards'!B10","v":27.869999999999997},{"$f":"'Components and Space Standards'!C10","v":300},{"$f":"'Components and Space Standards'!D10","v":"Circulation Module(s)"},{"$f":"'Components and Space Standards'!E10","v":"Per one-side bleachers - driven by gym size"},null,null,null,null,null,null,null,null,null,null,null,null,null,null,null,"Optional, 300 sf for 1 set bleachers, Additional circulation space for peak gym loads"]
[{"$f":"'Components and Space Standards'!A11","v":"Public restrooms/phones"},{"$f":"'Components and Space Standards'!B11","v":0},{"$f":"'Components and Space Standards'!C11","v":0},{"$f":"'Components and Space Standards'!D11","v":"Public Restroom(s)"},{"$f":"'Components and Space Standards'!E11","v":"Option - Driven by gym size"},null,null,null,null,null,null,null,null,null,3,null,null,null,null,null,"1 (uni), 1/1, ?/?, 4/6 (limit option to those below the facility size) Largest gym size drives largest bathroom. AF limited to top three options."]
[{"$f":"'Components and Space Standards'!A12","v":"Gymnasium"}]
[{"$f":"'Components and Space Standards'!A13","v":"Basketball/volleyball Court"},{"$f":"'Components and Space Standards'!B13","v":826.06679999999994},{"$f":"'Components and Space Standards'!C13","v":8892},{"$f":"'Components and Space Standards'!D13","v":"One-court/200-seat Module(s)"},{"$f":"'Components and Space Standards'!E13","v":"NCAA Court + 10' safety + 200 seats (one side)"},null,{"$f":"$B13*F13","v":0},{"$f":"F13*$C13","v":0},null,{"$f":"$B13*I13","v":0},{"$f":"I13*$C13","v":0},null,{"$f":"$B13*L13","v":0},{"$f":"L13*$C13","v":0},null,{"$f":"$B13*O13","v":0},{"$f":"O13*$C13","v":0},null,{"$f":"$B13*R13","v":0},{"$f":"R13*$C13","v":0},"Need both elements if indoor track is required."]
[{"$f":"'Components and Space Standards'!A14","v":"Two Court Module"},{"$f":"'Components and Space Standards'!B14","v":1630.9523999999999},{"$f":"'Components and Space Standards'!C14","v":17556},{"$f":"'Components and Space Standards'!D14","v":"Two-court/200-seat Module(s)"},{"$f":"'Components and Space Standards'!E14","v":"Two courts + 10' safety, 16' between cts, + 200 seats"},null,0,0,null,0,0,null,0,0,null,0,0,null,0,0]
[{"$f":"'Components and Space Standards'!A15","v":"Arena-style Two-Court Module"},{"$f":"'Components and Space Standards'!B15","v":1708.6168},{"$f":"'Components and Space Standards'!C15","v":18392},{"$f":"'Components and Space Standards'!D15","v":"Arena-style Two-Court Module(s)"},{"$f":"'Components and Space Standards'!E15","v":"Provides space for arena-style seating for center, longitudinal ct."},null,0,0,null,0,0,null,0,0,null,0,0,null,0,0]
[{"$f":"'Components and Space Standards'!A16","v":"Additional Spectator seating"},{"$f":"'Components and Space Standards'!B16","v":84.706219999999988},{"$f":"'Components and Space Standards'!C16","v":911.8},{"$f":"'Components and Space Standards'!D16","v":"Additional 200-seat Module(s)"},{"$f":"'Components and Space Standards'!E16","v":"Four rows of seats (one ea. side) = 200 ppl."},null,0,0,null,0,0,null,0,0,null,0,0,null,0,0]
[{"$f":"'Components and Space Standards'!A17","v":"Basic storage/support"},{"$f":"'Components and Space Standards'!B17","v":65.03},{"$f":"'Components and Space Standards'!C17","v":700},{"$f":"'Components and Space Standards'!D17","v":"Storage Module(s)"},{"$f":"'Components and Space Standards'!E17","v":"Roughly 8% of base gym area"},null,0,0,null,0,0,null,0,0,null,0,0,null,0,0]
[{"$f":"'Components and Space Standards'!A18","v":"Additional court storage"},{"$f":"'Components and Space Standards'!B18","v":32.515000000000001},{"$f":"'Components and Space Standards'!C18","v":350},{"$f":"'Components and Space Standards'!D18","v":"Additional storage module(s)"},{"$f":"'Components and Space Standards'!E18","v":"Storage space per additional court"},null,0,0,null,0,0,null,0,0,null,0,0,null,0,0]
[{"$f":"'Components and Space Standards'!A19","v":"Unit PT/Group Exercise"}]
[{"$f":"'Components and Space Standards'!A20","v":"Partitionable Room(s)"},{"$f":"'Components and Space Standards'!B20","v":4.6449999999999996},{"$f":"'Components and Space Standards'!C20","v":50},{"$f":"'Components and Space Standards'!D20","v":"people at 4.6 m2 (50 ft.2)/person"},{"$f":"'Components and Space Standards'!E20","v":"116.1 m2 (1,250 ft.2) (25 ppl) minimum size"},44,{"$f":"$B20*F20","v":204.38},{"$f":"F20*$C20","v":2200},58,{"$f":"$B20*I20","v":269.40999999999997},{"$f":"I20*$C20","v":2900},91,{"$f":"$B20*L20","v":422.69499999999994},{"$f":"L20*$C20","v":4550},140,{"$f":"$B20*O20","v":650.29999999999995},{"$f":"O20*$C20","v":7000},150,{"$f":"$B20*R20","v":696.74999999999989},{"$f":"R20*$C20","v":7500},"1250 = min. Navy, AF, MC / 2500 = min Army"]
[{"$f":"'Components and Space Standards'!A21","v":"Storage/support"},{"$f":"'Components and Space Standards'!B21","v":0.46449999999999997},{"$f":"'Components and Space Standards'!C21","v":5},{"$f":"'Components and Space Standards'!D21","v":"10% of partitionable room area"},{"$f":"'Components and Space Standards'!E21","v":"11.6 m2 (125 ft.2) minimum (10% of room area)"},{"$f":"F20","v":44},{"$f":"$B21*F21","v":20.437999999999999},{"$f":"F21*$C21","v":220},{"$f":"I20","v":58},{"$f":"$B21*I21","v":26.940999999999999},{"$f":"I21*$C21","v":290},{"$f":"L20","v":91},{"$f":"$B21*L21","v":42.269499999999994},{"$f":"L21*$C21","v":455},{"$f":"O20","v":140},{"$f":"$B21*O21","v":65.03},{"$f":"O21*$C21","v":700},{"$f":"R20","v":150},{"$f":"$B21*R21","v":69.674999999999997},{"$f":"R21*$C21","v":750}]
[{"$f":"'Components and Space Standards'!A22","v":"Fitness Spaces"}]
[{"$f":"'Components and Space Standards'!A23","v":"Stretching"},{"$f":"'Components and Space Standards'!B23","v":4.6449999999999996},{"$f":"'Components and Space Standards'!C23","v":50},{"$f":"'Components and Space Standards'!D23","v":"people at 4.6 m2 (50 ft.2)/person"},{"$f":"'Components and Space Standards'!E23","v":"50 sf per person - min. 2 ppl"},2,{"$f":"$B23*F23","v":9.2899999999999991},{"$f":"F23*$C23","v":100},3,{"$f":"$B23*I23","v":13.934999999999999},{"$f":"I23*$C23","v":150},4,{"$f":"$B23*L23","v":18.579999999999998},{"$f":"L23*$C23","v":200},5,{"$f":"$B23*O23","v":23.224999999999998},{"$f":"O23*$C23","v":250},null,{"$f":"$B23*R23","v":0},{"$f":"R23*$C23","v":0},"See Fitness Space sheet and exist. docs for these numbers"]
[{"$f":"'Components and Space Standards'!A24","v":"Cardiovascular Equipment"},{"$f":"'Components and Space Standards'!B24","v":4.6449999999999996},{"$f":"'Components and Space Standards'!C24","v":50},{"$f":"'Components and Space Standards'!D24","v":"items at 4.6 m2 (50 ft.2)/item"},{"$f":"'Components and Space Standards'!E24","v":"50 sf per station"},11,51.094999999999999,550,27,125.41499999999999,1350,null,0,0,null,0,0,null,0,0]
[{"$f":"'Components and Space Standards'!A25","v":"Selectorized (machine) weights"},{"$f":"'Components and Space Standards'!B25","v":4.6449999999999996},{"$f":"'Components and Space Standards'!C25","v":50},{"$f":"'Components and Space Standards'!D25","v":"items at 4.6 m2 (50 ft.2)/item"},{"$f":"'Components and Space Standards'!E25","v":"50 sf per station"},16,74.319999999999993,800,27,125.41499999999999,1350,null,0,0,null,0,0,null,0,0]
[{"$f":"'Components and Space Standards'!A26","v":"Free/Plate-loaded weights"},{"$f":"'Components and Space Standards'!B26","v":6.0385},{"$f":"'Components and Space Standards'!C26","v":65},{"$f":"'Components and Space Standards'!D26","v":"stations at 6.0 m2 (65 ft.2)/stations"},{"$f":"'Components and Space Standards'!E26","v":"65 sf per station"},15,90.577500000000001,975,29,175.1165,1885,null,0,0,null,0,0,null,0,0]
[{"$f":"'Components and Space Standards'!A27","v":"Finess Program Manager's Office"},{"$f":"'Components and Space Standards'!B27","v":11.612499999999999},{"$f":"'Components and Space Standards'!C27","v":125},{"$f":"'Components and Space Standards'!D27","v":"Office"},{"$f":"'Components and Space Standards'!E27","v":"Private office that may include fitness testing equipment"},null,0,0,null,0,0,null,0,0,null,0,0,null,0,0]
[{"$f":"'Components and Space Standards'!A28","v":"Fitness Assessment Room"},{"$f":"'Components and Space Standards'!B28","v":11.612499999999999},{"$f":"'Components and Space Standards'!C28","v":125},{"$f":"'Components and Space Standards'!D28","v":"Office(s)"},{"$f":"'Components and Space Standards'!E28","v":"1 piece fitness equip for testing, computer desk, chairs, stretching"},1,11.612499999999999,125,1,11.612499999999999,125,1,11.612499999999999,125,1,11.612499999999999,125,1,11.612499999999999,125]
[{"$f":"'Components and Space Standards'!A29","v":"Structured Activities"}]
[{"$f":"'Components and Space Standards'!A30","v":"Structured Activity Space"},{"$f":"'Components and Space Standards'!B30","v":74.319999999999993},{"$f":"'Components and Space Standards'!C30","v":800},{"$f":"'Components and Space Standards'!D30","v":"Flexible space Module(s)"},{"$f":"'Components and Space Standards'!E30","v":"Based on size of a single racquetball court"},1.5,{"$f":"$B30*F30","v":111.47999999999999},{"$f":"F30*$C30","v":1200},1.5,{"$f":"$B30*I30","v":111.47999999999999},{"$f":"I30*$C30","v":1200},3,{"$f":"$B30*L30","v":222.95999999999998},{"$f":"L30*$C30","v":2400},3,{"$f":"$B30*O30","v":222.95999999999998},{"$f":"O30*$C30","v":2400},null,{"$f":"$B30*R30","v":0},{"$f":"R30*$C30","v":0},"equip. based"]
[{"$f":"'Components and Space Standards'!A31","v":"Racquetball Courts"},{"$f":"'Components and Space Standards'!B31","v":74.319999999999993},{"$f":"'Components and Space Standards'!C31","v":800},{"$f":"'Components and Space Standards'!D31","v":"Racquetball Court(s)"},{"$f":"'Components and Space Standards'!E31","v":"Single court size. Minimum of two courts"},1,{"$f":"$B31*F31","v":74.319999999999993},{"$f":"F31*$C31","v":800},2,{"$f":"$B31*I31","v":148.63999999999999},{"$f":"I31*$C31","v":1600},4,{"$f":"$B31*L31","v":297.27999999999997},{"$f":"L31*$C31","v":3200},4,{"$f":"$B31*O31","v":297.27999999999997},{"$f":"O31*$C31","v":3200},null,{"$f":"$B31*R31","v":0},{"$f":"R31*$C31","v":0}]
[{"$f":"'Components and Space Standards'!A34","v":"Spectator/officiating (MC Option)"},{"$f":"'Components and Space Standards'!B34","v":18.579999999999998},{"$f":"'Components and Space Standards'!C34","v":200},{"$f":"'Components and Space Standards'!D34","v":"Spectator/officiating Module(s)"},{"$f":"'Components and Space Standards'!E34","v":"Two rows of 10 seats for one ct. Max of two cts (400 sf)"},null,{"$f":"$B32*F32","v":0},{"$f":"F32*$C32","v":0},null,{"$f":"$B32*I32","v":0},{"$f":"I32*$C32","v":0},null,{"$f":"$B32*L32","v":0},{"$f":"L32*$C32","v":0},null,{"$f":"$B32*O32","v":0},{"$f":"O32*$C32","v":0},null,{"$f":"$B32*R32","v":0},{"$f":"R32*$C32","v":0}]
[{"$f":"'Components and Space Standards'!A35","v":"Structured activity storage"},{"$f":"'Components and Space Standards'!B35","v":7.4319999999999995},{"$f":"'Components and Space Standards'!C35","v":80},{"$f":"'Components and Space Standards'!D35","v":"10% of Structured Activity Space"},{"$f":"'Components and Space Standards'!E35","v":"Based on Structured activity space (10% of room area)"}]
[{"$f":"'Components and Space Standards'!A36","v":"Locker Rooms"},null,null,null,null,null,null,null,null,null,null,null,null,null,null,null,null,null,null,null,"Apply male/female split on occupant load, then calculate individual male and female locker areas from the split number."]
[{"$f":"'Components and Space Standards'!A37","v":"Men's Locker Room"},{"$f":"'Components and Space Standards'!B37","v":0},{"$f":"'Components and Space Standards'!C37","v":0},{"$f":"'Components and Space Standards'!D37","v":0},{"$f":"'Components and Space Standards'!E37","v":0},null,{"$f":"$B35*F35","v":0},{"$f":"F35*$C35","v":0},null,{"$f":"$B35*I35","v":0},{"$f":"I35*$C35","v":0},null,{"$f":"$B35*L35","v":0},{"$f":"L35*$C35","v":0},null,{"$f":"$B35*O35","v":0},{"$f":"O35*$C35","v":0},null,{"$f":"$B35*R35","v":0},{"$f":"R35*$C35","v":0}]
[{"$f":"'Components and Space Standards'!A38","v":"Locker/changing area"},{"$f":"'Components and Space Standards'!B38","v":0.74319999999999997},{"$f":"'Components and Space Standards'!C38","v":8},{"$f":"'Components and Space Standards'!D38","v":"Lockers"},{"$f":"'Components and Space Standards'!E38","v":"Per slot (2 double lockers or 1 single locker)"},null,0,0,null,0,0,null,0,0,null,0,0,null,0,0,"Ratios: 1 to 1 (all full), 66% (1 full per 2 dbls -  or 3 ppl / 2 slots), 50% (all double lockers) - Environmental adjust factor ----- "]
[{"$f":"'Components and Space Standards'!A39","v":"Shower/drying area"},{"$f":"'Components and Space Standards'!B39","v":2.7869999999999999},{"$f":"'Components and Space Standards'!C39","v":30},{"$f":"'Components and Space Standards'!D39","v":"Showers"},{"$f":"'Components and Space Standards'!E39","v":"Per shower & integral drying area at 22 lockers/shower"},null,0,0,null,0,0,null,0,0,null,0,0,null,0,0]
[{"$f":"'Components and Space Standards'!A40","v":"Toilet area"},{"$f":"'Components and Space Standards'!B40","v":4.1804999999999994},{"$f":"'Components and Space Standards'!C40","v":45},{"$f":"'Components and Space Standards'!D40","v":"Water closets/lavatory modules"},{"$f":"'Components and Space Standards'!E40","v":"Per wc and lav. at 30 lockers per wc/lav"},null,0,0,null,0,0,null,0,0,null,0,0,null,0,0,"Will confirm that 30 lockers per wc/lav is the correct formula"]
[{"$f":"'Components and Space Standards'!A41","v":"Women's Locker Room"},{"$f":"'Components and Space Standards'!B41","v":0},{"$f":"'Components and Space Standards'!C41","v":0},{"$f":"'Components and Space Standards'!D41","v":0},{"$f":"'Components and Space Standards'!E41","v":0},null,0,0,null,0,0,null,0,0,null,0,0,null,0,0]
[{"$f":"'Components and Space Standards'!A42","v":"Locker/changing area"},{"$f":"'Components and Space Standards'!B42","v":0.74319999999999997},{"$f":"'Components and Space Standards'!C42","v":8},{"$f":"'Components and Space Standards'!D42","v":"Lockers"},{"$f":"'Components and Space Standards'!E42","v":"Per slot (2 double lockers or 1 single locker)"},null,0,0,null,0,0,null,0,0,null,0,0,null,0,0]
[{"$f":"'Components and Space Standards'!A43","v":"Shower/drying area"},{"$f":"'Components and Space Standards'!B43","v":2.7869999999999999},{"$f":"'Components and Space Standards'!C43","v":30},{"$f":"'Components and Space Standards'!D43","v":"Showers"},{"$f":"'Components and Space Standards'!E43","v":"Per shower & integral drying area at 22 lockers/shower"},null,0,0,null,0,0,null,0,0,null,0,0,null,0,0]
[{"$f":"'Components and Space Standards'!A44","v":"Toilet area"},{"$f":"'Components and Space Standards'!B44","v":4.1804999999999994},{"$f":"'Components and Space Standards'!C44","v":45},{"$f":"'Components and Space Standards'!D44","v":"Water closets/lavatory modules"},{"$f":"'Components and Space Standards'!E44","v":"per wc and lav. at 20 lockers per wc/lav"},null,0,0,null,0,0,null,0,0,null,0,0,null,0,0,"Will confirm that 20 lockers per wc/lav is the correct formula"]
[{"$f":"'Components and Space Standards'!A45","v":"Sauna, cool-down area"},{"$f":"'Components and Space Standards'!B45","v":0},{"$f":"'Components and Space Standards'!C45","v":0},{"$f":"'Components and Space Standards'!D45","v":"M/F (2) Saunas/cool-down area"},{"$f":"'Components and Space Standards'!E45","v":"small = 6 ppl, med = 8-9, lg = 12 ppl (+ cool down space)"},null,null,null,null,null,null,null,null,null,null,null,null,null,null,null,"Optional in MC facilities"]
[{"$f":"'Components and Space Standards'!A46","v":"Steam Room, cool-down area"},{"$f":"'Components and Space Standards'!B46","v":0},{"$f":"'Components and Space Standards'!C46","v":0},{"$f":"'Components and Space Standards'!D46","v":"M/F (2) Steam Rooms/cool-down area"},{"$f":"'Components and Space Standards'!E46","v":"small = 6-7 ppl, med = 8-9, lg = 12-14 (+ cool down space)"},null,null,null,null,null,null,null,null,null,null,null,null,null,null,null,"Not included in MC facilities"]
[{"$f":"'Components and Space Standards'!A47","v":"Hot Tub"},{"$f":"'Components and Space Standards'!B47","v":0},{"$f":"'Components and Space Standards'!C47","v":0},{"$f":"'Components and Space Standards'!D47","v":"Unisex Hot Tub"},{"$f":"'Components and Space Standards'!E47","v":"small = 5 ppl, med = 8, lg = 12-14 ppl"},null,null,null,null,null,null,null,null,null,null,null,null,null,null,null,"Not included in MC facilities"]
[{"$f":"'Components and Space Standards'!A48","v":"Support Areas"}]
[{"$f":"'Components and Space Standards'!A49","v":"Laundry"},{"$f":"'Components and Space Standards'!B49","v":18.579999999999998},{"$f":"'Components and Space Standards'!C49","v":200},{"$f":"'Components and Space Standards'!D49","v":"Laundry Room"},{"$f":"'Components and Space Standards'!E49","v":"Per one-washer/two-dryer room"},null,null,null,3,null,null,4,null,null,null,null,null,null,null,null,"One washer, two dryers, commercial equip, folding table, sink, storage shelves, laundry carts, and opt. ice machine."]
[{"$f":"'Components and Space Standards'!A50","v":"Equipment repair and receiving"},{"$f":"'Components and Space Standards'!B50","v":0},{"$f":"'Components and Space Standards'!C50","v":0},{"$f":"'Components and Space Standards'!D50","v":"Repair/receiving Room"},{"$f":"'Components and Space Standards'!E50","v":"Fixed receiving area + variable repair (10% of Fitness)"},null,null,null,null,null,null,null,null,null,null,null,null,null,null,null,"10% of total Fitness (Army) / 250 sf (AF)"]
[{"$f":"'Components and Space Standards'!A51","v":"Storage"},{"$f":"'Components and Space Standards'!B51","v":0},{"$f":"'Components and Space Standards'!C51","v":0},{"$f":"'Components and Space Standards'!D51","v":"Storage Room"},{"$f":"'Components and Space Standards'!E51","v":"Variable lockable storage room (5% of fitness)"}]
[{"$f":"'Components and Space Standards'!A52","v":"Additional Programmatic Storage"},{"$f":"'Components and Space Standards'!B52","v":0},{"$f":"'Components and Space Standards'!C52","v":0},{"$f":"'Components and Space Standards'!D52","v":" sf  Additional Storage"},{"$f":"'Components and Space Standards'!E52","v":"To be filled-in by programmer and justified based on item stored."}]
[{"$f":"'Components and Space Standards'!A53:E53","v":"Janitor's Closet(s)"},{"$f":"'Components and Space Standards'!B53:F53","v":3.7159999999999997},{"$f":"'Components and Space Standards'!C53","v":40},{"$f":"'Components and Space Standards'!D53:G53","v":"40 SF/closet"},{"$f":"'Components and Space Standards'!E53:H53","v":"Per Janitor's Closet"},2,{"$f":"$B51*F51","v":7.4319999999999995},{"$f":"F51*$C51","v":80},2,{"$f":"$B51*I51","v":7.4319999999999995},{"$f":"I51*$C51","v":80},3,{"$f":"$B51*L51","v":11.148},{"$f":"L51*$C51","v":120},4,{"$f":"$B51*O51","v":14.863999999999999},{"$f":"O51*$C51","v":160},4,{"$f":"$B51*R51","v":14.863999999999999},{"$f":"R51*$C51","v":160},4,{"$f":"$B51*U51","v":14.863999999999999},{"$f":"U51*$C51","v":160}]
[{"$f":"'Components and Space Standards'!A54","v":"Health Promotion Spaces - Marine Corps Only (Required or Optional)"},{"$f":"'Components and Space Standards'!B54","v":0},{"$f":"'Components and Space Standards'!C54","v":0},{"$f":"'Components and Space Standards'!D54","v":0},{"$f":"'Components and Space Standards'!E54","v":0}]
[{"$f":"'Components and Space Standards'!A55","v":"Lobby/Reception"},{"$f":"'Components and Space Standards'!B55","v":27.869999999999997},{"$f":"'Components and Space Standards'!C55","v":300},{"$f":"'Components and Space Standards'!D55","v":"Lobby/Reception Module(s)"},{"$f":"'Components and Space Standards'!E55","v":"per area"},null,{"$f":"$B53*F53","v":0},{"$f":"F53*$C53","v":0},null,{"$f":"$B53*I53","v":0},{"$f":"I53*$C53","v":0},null,{"$f":"$B53*L53","v":0},{"$f":"L53*$C53","v":0},null,{"$f":"$B53*O53","v":0},{"$f":"O53*$C53","v":0},null,{"$f":"$B53*R53","v":0},{"$f":"R53*$C53","v":0},"From AF"]
[{"$f":"'Components and Space Standards'!A56","v":"Director's Office"},{"$f":"'Components and Space Standards'!B56","v":11.148},{"$f":"'Components and Space Standards'!C56","v":120},{"$f":"'Components and Space Standards'!D56","v":"Office"},{"$f":"'Components and Space Standards'!E56","v":"per office"},null,0,0,null,0,0,null,0,0,null,0,0,null,0,0,"AF office area = 400 sf total"]
[{"$f":"'Components and Space Standards'!A57","v":"Program Managers' Offices"},{"$f":"'Components and Space Standards'!B57","v":9.2899999999999991},{"$f":"'Components and Space Standards'!C57","v":100},{"$f":"'Components and Space Standards'!D57","v":"Office(s)"},{"$f":"'Components and Space Standards'!E57","v":"per office"},null,0,0,1,9.2899999999999991,100,1,9.2899999999999991,100,1,9.2899999999999991,100,null,0,0]
[{"$f":"'Components and Space Standards'!A58","v":"Support Staff Workstations"},{"$f":"'Components and Space Standards'!B58","v":5.9455999999999998},{"$f":"'Components and Space Standards'!C58","v":64},{"$f":"'Components and Space Standards'!D58","v":"Workstation(s)"},{"$f":"'Components and Space Standards'!E58","v":"per workstation"},null,0,0,1,5.9455999999999998,64,1,5.9455999999999998,64,1,5.9455999999999998,64,null,0,0]
[{"$f":"'Components and Space Standards'!A59","v":"Classrooms/Training rooms"},{"$f":"'Components and Space Standards'!B59","v":58.527000000000001},{"$f":"'Components and Space Standards'!C59","v":630},{"$f":"'Components and Space Standards'!D59","v":"Classroom/Training Module(s)"},{"$f":"'Components and Space Standards'!E59","v":"per room"},1,58.527000000000001,630,1,58.527000000000001,630,1,58.527000000000001,630,2,117.054,1260,null,0,0,"From AF"]
[{"$f":"'Components and Space Standards'!A60","v":"Resource Room/Computer Lab"},{"$f":"'Components and Space Standards'!B60","v":23.224999999999998},{"$f":"'Components and Space Standards'!C60","v":250},{"$f":"'Components and Space Standards'!D60","v":"Resource/Computer Lab Module(s)"},{"$f":"'Components and Space Standards'!E60","v":"per room"},null,0,0,1,23.224999999999998,250,1,23.224999999999998,250,1,23.224999999999998,250,null,0,0,"From AF - combines comp lab with resource library"]
[{"$f":"'Components and Space Standards'!A61","v":"Storage/support"},{"$f":"'Components and Space Standards'!B61","v":7.4319999999999995},{"$f":"'Components and Space Standards'!C61","v":80},{"$f":"'Components and Space Standards'!D61","v":"Storage/support Module(s)"},{"$f":"'Components and Space Standards'!E61","v":"per area"},null,0,0,1,7.4319999999999995,80,1,7.4319999999999995,80,1,7.4319999999999995,80,null,0,0]
[{"$f":"'Components and Space Standards'!A63","v":"Ergometry and Fitness Testing *"},{"$f":"'Components and Space Standards'!B63","v":7.4319999999999995},{"$f":"'Components and Space Standards'!C63","v":80},{"$f":"'Components and Space Standards'!D63","v":"Testing Cubicle(s)"},{"$f":"'Components and Space Standards'!E63","v":"per testing cubicles"},1,7.4319999999999995,80,2,14.863999999999999,160,2,14.863999999999999,160,3,22.295999999999999,240,null,0,0,"From AF - cubicles go in an enclosed room (need circulation beteen cubicles--doesn't seem to be accounted for in AF criteria?)"]
[{"$f":"'Components and Space Standards'!A64","v":"Wellness Assessment *"},{"$f":"'Components and Space Standards'!B64","v":13.934999999999999},{"$f":"'Components and Space Standards'!C64","v":150},{"$f":"'Components and Space Standards'!D64","v":"Assessment Room(s)"},{"$f":"'Components and Space Standards'!E64","v":"per room"},null,0,0,null,0,0,null,0,0,null,0,0,null,0,0,"From AF"]
[{"$f":"'Components and Space Standards'!A65","v":"Administrative Spaces (required or optional)"},{"$f":"'Components and Space Standards'!B65","v":0},{"$f":"'Components and Space Standards'!C65","v":0},{"$f":"'Components and Space Standards'!D65","v":0},{"$f":"'Components and Space Standards'!E65","v":0}]
[{"$f":"'Components and Space Standards'!A66","v":"Director's Office"},{"$f":"'Components and Space Standards'!B66","v":11.148},{"$f":"'Components and Space Standards'!C66","v":120},{"$f":"'Components and Space Standards'!D66","v":"Office"},{"$f":"'Components and Space Standards'!E66","v":"per office"},1,0,{"$f":"F63*$C63","v":120},1,{"$f":"$B63*I63","v":11.148},{"$f":"I63*$C63","v":120},1,{"$f":"$B63*L63","v":11.148},{"$f":"L63*$C63","v":120},1,{"$f":"$B63*O63","v":11.148},{"$f":"O63*$C63","v":120},null,{"$f":"$B63*R63","v":0},{"$f":"R63*$C63","v":0},"req."]
[{"$f":"'Components and Space Standards'!A67","v":"Program Managers' Offices"},{"$f":"'Components and Space Standards'!B67","v":9.2899999999999991},{"$f":"'Components and Space Standards'!C67","v":100},{"$f":"'Components and Space Standards'!D67","v":"Office(s)"},{"$f":"'Components and Space Standards'!E67","v":"per office"},1,{"$f":"$B64*F64","v":9.2899999999999991},100,2,18.579999999999998,200,2,18.579999999999998,200,2,18.579999999999998,200,null,0,0,"optional (req. AF)"]
[{"$f":"'Components and Space Standards'!A68","v":"Support Staff Workstations"},{"$f":"'Components and Space Standards'!B68","v":5.9455999999999998},{"$f":"'Components and Space Standards'!C68","v":64},{"$f":"'Components and Space Standards'!D68","v":"Workstation(s)"},{"$f":"'Components and Space Standards'!E68","v":"per office"},3,{"$f":"$B65*F65","v":17.8368},192,4,23.782399999999999,256,6,35.6736,384,8,47.564799999999998,512,null,0,0,"optional (req. AF)"]
[{"$f":"'Components and Space Standards'!A69","v":"Copy/file/work/break Room"},{"$f":"'Components and Space Standards'!B69","v":7.4319999999999995},{"$f":"'Components and Space Standards'!C69","v":80},{"$f":"'Components and Space Standards'!D69","v":"Workroom Module(s)"},{"$f":"'Components and Space Standards'!E69","v":"per room"},1,{"$f":"$B66*F66","v":7.4319999999999995},80,1,7.4319999999999995,80,2,14.863999999999999,160,2,14.863999999999999,160,null,0,0,"req."]
[{"$f":"'Components and Space Standards'!A70","v":"Classroom/Training Room"},{"$f":"'Components and Space Standards'!B70","v":69.674999999999997},{"$f":"'Components and Space Standards'!C70","v":750},{"$f":"'Components and Space Standards'!D70","v":"25-person Module at 750 SF"},{"$f":"'Components and Space Standards'!E70","v":"1,500 SF Med/Lge & 2,250 SF for Xtra Lge/Jumbo"},1,{"$f":"$B67*F67","v":69.674999999999997},750,1,69.674999999999997,750,2,139.35,1500,2,139.35,1500,3,209.02499999999998,2250,"Req. Program space"]
[{"$f":"'Components and Space Standards'!A71","v":"Classroom/Training Storage"},{"$f":"'Components and Space Standards'!B71","v":5.5739999999999998},{"$f":"'Components and Space Standards'!C71","v":60},{"$f":"'Components and Space Standards'!D71","v":"Storage Module(s)"},{"$f":"'Components and Space Standards'!E71","v":"per 25-person Training Room"},1,{"$f":"$B68*F68","v":5.5739999999999998},60,1,5.5739999999999998,60,2,11.148,120,2,11.148,120,3,16.722000000000001,180]
[{"$f":"'Components and Space Standards'!A72","v":"Optional or Service-specific Program Spaces"},{"$f":"'Components and Space Standards'!B72","v":0},{"$f":"'Components and Space Standards'!C72","v":0},{"$f":"'Components and Space Standards'!D72","v":0},{"$f":"'Components and Space Standards'!E72","v":0}]
[{"$f":"'Components and Space Standards'!A75","v":"Indoor Track"}]
[{"$f":"'Components and Space Standards'!A76","v":"Indoor Track"}]
[{"$f":"'Components and Space Standards'!A77","v":"1/14th-mile Indoor Track"},{"$f":"'Components and Space Standards'!B77","v":310.00729999999999},{"$f":"'Components and Space Standards'!C77","v":3337},{"$f":"'Components and Space Standards'!D77","v":"1/14th-mile, 2-lane Indoor Track "},{"$f":"'Components and Space Standards'!E77","v":"1/14th-mile, 2-lane Indoor Track (754 linear ft.)"},null,{"$f":"$B72*F72","v":0},{"$f":"F72*$C72","v":0},null,{"$f":"$B72*I72","v":0},{"$f":"I72*$C72","v":0},null,{"$f":"$B72*L72","v":0},{"$f":"L72*$C72","v":0},null,{"$f":"$B72*O72","v":0},{"$f":"O72*$C72","v":0},null,{"$f":"$B72*R72","v":0},{"$f":"R72*$C72","v":0},"(smallest gym option, Army and Navy only)"]
[{"$f":"'Components and Space Standards'!A78","v":"1/12th-mile Indoor Track"},{"$f":"'Components and Space Standards'!B78","v":523.02699999999993},{"$f":"'Components and Space Standards'!C78","v":5630},{"$f":"'Components and Space Standards'!D78","v":"1/12th-mile, 3-lane Indoor Track"},{"$f":"'Components and Space Standards'!E78","v":"1/12th-mile, 3-lane Indoor Track (1284 linear ft.)"}]
[{"$f":"'Components and Space Standards'!A79","v":"1/11th-mile Indoor Track"},{"$f":"'Components and Space Standards'!B79","v":556.74969999999996},{"$f":"'Components and Space Standards'!C79","v":5993},{"$f":"'Components and Space Standards'!D79","v":"1/11th-mile, 3-lane Indoor Track "},{"$f":"'Components and Space Standards'!E79","v":"1/11th-mile, 3-lane Indoor Track (1440 linear ft.)"},null,0,0,null,0,0,null,0,0,null,0,0,null,0,0]
[{"$f":"'Components and Space Standards'!A80","v":"1/8th-mile Indoor Track"},{"$f":"'Components and Space Standards'!B80","v":989.10629999999992},{"$f":"'Components and Space Standards'!C80","v":10647},{"$f":"'Components and Space Standards'!D80","v":"1/8th-mile, 4-lane Indoor Track "},{"$f":"'Components and Space Standards'!E80","v":"1/8th-mile, 4-lane Indoor Track (2640 linear ft.)"},null,0,0,null,0,0,null,0,0,null,0,0,null,0,0]
[{"$f":"'Components and Space Standards'!A81","v":"Indoor track lobby"},{"$f":"'Components and Space Standards'!B81","v":13.377599999999999},{"$f":"'Components and Space Standards'!C81","v":144},{"$f":"'Components and Space Standards'!D81","v":"Indoor track lobby(ies)"},{"$f":"'Components and Space Standards'!E81","v":"Access point to lobby from stair/elevator"},1,13.377599999999999,144,1.5,20.066399999999998,216,1.5,20.066399999999998,216,1.5,20.066399999999998,216,1.5,20.066399999999998,216]
[{"$f":"'Components and Space Standards'!A82","v":"Additional Group Exercise Room"},{"$f":"'Components and Space Standards'!B82","v":116.125},{"$f":"'Components and Space Standards'!C82","v":1250},{"$f":"'Components and Space Standards'!D82","v":"Additional Group Exercise Room"},{"$f":"'Components and Space Standards'!E82","v":"per room"},null,0,0,null,0,0,null,0,0,null,0,0,null,0,0,"Optional catch-up space"]
[{"$f":"'Components and Space Standards'!A83","v":"Massage Room"},{"$f":"'Components and Space Standards'!B83","v":11.148},{"$f":"'Components and Space Standards'!C83","v":120},{"$f":"'Components and Space Standards'!D83","v":"Massage Room(s)"},{"$f":"'Components and Space Standards'!E83","v":"per room"},null,0,0,null,0,0,null,0,0,null,0,0,null,0,0]
[{"$f":"'Components and Space Standards'!A84","v":"Physical Therapy Training"},{"$f":"'Components and Space Standards'!B84","v":11.612499999999999},{"$f":"'Components and Space Standards'!C84","v":125},{"$f":"'Components and Space Standards'!D84","v":"Physical Therapy Training Room(s)"},{"$f":"'Components and Space Standards'!E84","v":"per room"},null,0,0,null,0,0,null,0,0,null,0,0,null,0,0,"similar to fitness assement"]
[{"$f":"'Components and Space Standards'!A85","v":"Expanded Retail 1"},{"$f":"'Components and Space Standards'!B85","v":9.2899999999999991},{"$f":"'Components and Space Standards'!C85","v":100},{"$f":"'Components and Space Standards'!D85","v":"Expanded Retail Module(s)"},{"$f":"'Components and Space Standards'!E85","v":"per area"},null,0,0,null,0,0,null,0,0,null,0,0,null,0,0,"dry good, sports equip, clothes, etc. Usually contractor and sep from control"]
[{"$f":"'Components and Space Standards'!A86","v":"Expanded Juice Bar 1"},{"$f":"'Components and Space Standards'!B86","v":13.934999999999999},{"$f":"'Components and Space Standards'!C86","v":150},{"$f":"'Components and Space Standards'!D86","v":"Expanded Juice Bar Module(s)"},{"$f":"'Components and Space Standards'!E86","v":"per area"},null,0,0,null,0,0,null,0,0,null,0,0,null,0,0,"Additional food/beverage counter. Usually contractor and sep from control"]
[{"$f":"'Components and Space Standards'!A87","v":"Expanded Juice Bar Seating"},{"$f":"'Components and Space Standards'!B87","v":13.934999999999999},{"$f":"'Components and Space Standards'!C87","v":150},{"$f":"'Components and Space Standards'!D87","v":"Two-table seating Module(s)"},{"$f":"'Components and Space Standards'!E87","v":"Two 4-top tables and seating area"},null,0,0,null,0,0,null,0,0,null,0,0,null,0,0]
[{"$f":"'Components and Space Standards'!A88","v":"Family Changing Room"},{"$f":"'Components and Space Standards'!B88","v":10.218999999999999},{"$f":"'Components and Space Standards'!C88","v":110},{"$f":"'Components and Space Standards'!D88","v":"Family Changing Room(s)"},{"$f":"'Components and Space Standards'!E88","v":"per shower, wc, lav, changing, and locker"},1,10.218999999999999,110,2,20.437999999999999,220,3,30.656999999999996,330,4,40.875999999999998,440,5,51.094999999999999,550,"Indiv. locker area for parent & child (grows by adding showers and changing stalls plus lockers)"]
[{"$f":"'Components and Space Standards'!A89","v":"Convertible Locker Space"},{"$f":"'Components and Space Standards'!B89","v":69.674999999999997},{"$f":"'Components and Space Standards'!C89","v":750},{"$f":"'Components and Space Standards'!D89","v":"Add'l male or female space"},{"$f":"'Components and Space Standards'!E89","v":"750 sf"},0,0,0,0,0,0,0,0,0,1,69.674999999999997,750,1,69.674999999999997,750,"AF-only option. Calculate how many people this accomodates"]
[{"$f":"'Components and Space Standards'!A90","v":"Female DV Locker Room *"},{"$f":"'Components and Space Standards'!B90","v":23.224999999999998},{"$f":"'Components and Space Standards'!C90","v":250},{"$f":"'Components and Space Standards'!D90","v":"Female DV Locker Room"},{"$f":"'Components and Space Standards'!E90","v":"250, 500, 750"},null,0,0,null,0,0,null,0,0,null,0,0,null,0,0]
[{"$f":"'Components and Space Standards'!A91","v":"Child Play Area/Parent Child Area *"},{"$f":"'Components and Space Standards'!B91","v":74.319999999999993},{"$f":"'Components and Space Standards'!C91","v":800},{"$f":"'Components and Space Standards'!D91","v":"Parent/child Module(s)"},{"$f":"'Components and Space Standards'!E91","v":"400 sf play area (at 35 sf/child), 400 sf equip (50 sf/equip)"},0.5,37.159999999999997,400,0.5,37.159999999999997,400,0.5,37.159999999999997,400,0.5,37.159999999999997,400,null,0,0]
[{"$f":"'Components and Space Standards'!A92","v":"HAWC Demonstration Kitchen"},{"$f":"'Components and Space Standards'!B92","v":46.449999999999996},{"$f":"'Components and Space Standards'!C92","v":500},{"$f":"'Components and Space Standards'!D92","v":"Kitchen Module(s)"},{"$f":"'Components and Space Standards'!E92","v":"per kitchen"},null,0,0,null,0,0,null,1,0,1,46.449999999999996,500,null,0,0,"From AF"]
[{"$f":"'Components and Space Standards'!A93","v":"HAWC Relaxation Room *"},{"$f":"'Components and Space Standards'!B93","v":9.2899999999999991},{"$f":"'Components and Space Standards'!C93","v":100},{"$f":"'Components and Space Standards'!D93","v":"Relaxation Room(s)"},{"$f":"'Components and Space Standards'!E93","v":"per room"},null,0,0,null,0,0,null,{"$f":"$B88*L88","v":0},0,null,0,0,null,0,0,"From AF"]
[{"$f":"'Components and Space Standards'!A94","v":"Site Spaces"}]
[{"$f":"'Components and Space Standards'!A95","v":"Staff Parking"},{"$f":"'Components and Space Standards'!B95","v":41.805},{"$f":"'Components and Space Standards'!C95","v":450},{"$f":"'Components and Space Standards'!D95","v":"Parking Spaces"},{"$f":"'Components and Space Standards'!E95","v":"per space (including circulation)"},8,{"$f":"F90*B90","v":334.44},{"$f":"F90*C90","v":3600},9,{"$f":"$B90*I90","v":376.245},{"$f":"I90*$C90","v":4050},10,{"$f":"$B90*L90","v":418.05},{"$f":"L90*$C90","v":4500},12,{"$f":"$B90*O90","v":501.65999999999997},{"$f":"O90*$C90","v":5400},null,{"$f":"$B90*R90","v":0},{"$f":"R90*$C90","v":0}]
[{"$f":"'Components and Space Standards'!A96","v":"Loading dock"},{"$f":"'Components and Space Standards'!B96","v":8.3609999999999989},{"$f":"'Components and Space Standards'!C96","v":90},{"$f":"'Components and Space Standards'!D96","v":"Loading Dock"},{"$f":"'Components and Space Standards'!E96","v":"Per single-truck dock"},1,8.3609999999999989,90,1,8.3609999999999989,90,1,8.3609999999999989,90,1,8.3609999999999989,90,null,0,0]
[{"$f":"'Components and Space Standards'!A97","v":"Service Drive/trash"},{"$f":"'Components and Space Standards'!B97","v":69.674999999999997},{"$f":"'Components and Space Standards'!C97","v":750},{"$f":"'Components and Space Standards'!D97","v":"Service Drive Module"},{"$f":"'Components and Space Standards'!E97","v":"per area"},1,69.674999999999997,750,1,69.674999999999997,750,1,69.674999999999997,750,1,69.674999999999997,750,null,0,0]
[{"$f":"'Components and Space Standards'!A98","v":"Customer Parking"},{"$f":"'Components and Space Standards'!B98","v":41.805},{"$f":"'Components and Space Standards'!C98","v":450},{"$f":"'Components and Space Standards'!D98","v":"Parking Spaces"},{"$f":"'Components and Space Standards'!E98","v":"per space (including circulation)"},40,1672.2,18000,80,3344.4,36000,120,5016.6000000000004,54000,160,6688.8,72000,null,0,0]
[{"$f":"'Components and Space Standards'!A99","v":"Bicycle Rack Area"},{"$f":"'Components and Space Standards'!B99","v":14.863999999999999},{"$f":"'Components and Space Standards'!C99","v":160},{"$f":"'Components and Space Standards'!D99","v":"10-bike Rack(s)"},{"$f":"'Components and Space Standards'!E99","v":"per 10-bike Rack"},1,14.863999999999999,160,2,29.727999999999998,320,2,29.727999999999998,320,3,44.591999999999999,480,null,0,0]
[{"$f":"'Components and Space Standards'!A100","v":"Patio"},{"$f":"'Components and Space Standards'!B100","v":2.3224999999999998},{"$f":"'Components and Space Standards'!C100","v":25},{"$f":"'Components and Space Standards'!D100","v":"Patio Module(s)"},{"$f":"'Components and Space Standards'!E100","v":"per patio"},null,0,0,null,0,0,null,0,0,null,0,0,null,0,0]
[{"$f":"'Components and Space Standards'!A101","v":"* Service-specific space."}]
[{"$f":"'Components and Space Standards'!A102","v":"1 If contract service, verify area with contractor. "}]

{"sheet":"Interactive Worksheet","index":7,"n_rows":164,"n_cols":23,"rows_kept":164,"cut":false,"hidden":false,"merged":[[0,4,1,7],[14,20,15,20],[2,22,3,22],[40,22,41,22],[103,22,105,22],[133,22,134,22],[19,18,25,19],[2,12,2,20],[7,3,7,7],[0,0,1,1],[14,12,15,13],[14,14,15,15],[14,16,15,17],[0,2,1,3],[69,12,69,20],[14,18,15,19],[41,10,41,19],[19,12,25,13],[2,0,2,7],[8,1,12,2],[19,14,25,15],[153,22,154,22],[130,5,130,7],[134,0,136,3],[70,0,72,3],[104,0,106,3],[127,0,129,3],[125,12,125,19],[117,22,117,25],[15,1,15,2],[16,4,16,7],[17,0,18,7],[29,0,31,7],[106,12,106,19],[43,0,46,3],[42,4,44,4],[25,4,27,7],[19,16,25,17]]}
["FOR MOST MONITORS (1024x768) VIEW AT 100%.",null,"ENTER PROJECT NAME \nAND INFORMATION:",null,null,null,null,null,null,null,null,null,null,null,null,null,null,null,null,null,null,null,"Notes/ Comments"]
[null,null,null,null,null,null,null,null,null,"  < Shaded cells in J can indicate if there is data in that row that may be hidden. If so, shows the appropriate column letter."]
[{"$f":"IF(E1=0,\"Project Name and Information Here\",E1)","v":"Project Name and Information Here"},null,null,null,null,null,null,null,null,null,"Controls",null,"Additional Controls & Service Exceptions",null,null,null,null,null,null,null,null,null,"All:  The \"Click Here to Reset Sheet\" will clear all the entries in preparation for a new program. "]
[]
[{"$f":"IF(D5=0,\"1.  Select Service Branch:\",\"Service Branch\")","v":"1.  Select Service Branch:"}]
[null,null,null,null,null,null,null,null,null,null,"Navy"]
[]
[{"$f":"IF(D5=0,,IF(SUM(L9:L14)=1,\"Size of Facility:\",\"2.  Select size of facility:\"))","v":0},null,null,{"$f":"IF(D5=0,,\"Check box next to appropriate facility size.\")","v":0},null,null,null,null,null,null,"Marine Corps"]
[null,{"$f":"IF(D5=0,,IF(D5=K5,\"Army size options are to the right.  Check box next to the appropriate size.  Refer to UFC Section 2.1 for population criteria.\",IF(D5=K6,\"Navy size options are to the right.  Check box next to appropriate size.  Refer to UFC Section 2.1 for population criteria.\",IF(D5=K7,\"Air Force facilities are sized using a separate Service-specific spreadsheet that may be found at http://www-p.afsv.af.mil/FC/DesignGuides.htm.  Refer to UFC Section 2.1 for more information.\",IF(D5=K8,\"Marine Corps size options are to the right.  Check box next to appropriate size.  Also enter actual total Installation population size in the space provided.  Refer to UFC Section 2.1 for reference to population criteria.\",)))))","v":0},null,{"$f":"IF($D$5=0,,IF($D$5=$K$5,\"Extra Small\",IF($D$5=$K$6,\"Extra Small\",IF($D$5=$K$7,,IF($D$5=$K$8,\"Extra Small\",)))))","v":0},{"$f":"IF($D$5=0,,IF($D$5=$K$5,\"For populations of \"&'size classes'!C2,IF($D$5=$K$6,\"For populations of \"&'size classes'!C10,IF($D$5='Interactive Worksheet'!$K$7,,IF($D$5='Interactive Worksheet'!$K$8,\"For populations of \"&'size classes'!C25,)))))","v":0},null,null,null,null,null,false,{"$f":"IF(K9=TRUE,1,0)","v":0},{"$f":"D9","v":0},0]
[null,null,null,{"$f":"IF($D$5=0,,IF($D$5=$K$5,\"Small\",IF($D$5=$K$6,\"Small\",IF($D$5=$K$7,,IF($D$5=$K$8,\"Small\",)))))","v":0},{"$f":"IF($D$5=0,,IF($D$5=$K$5,\"For populations of \"&'size classes'!C3,IF($D$5=$K$6,\"For populations of \"&'size classes'!C11,IF($D$5='Interactive Worksheet'!$K$7,,IF($D$5='Interactive Worksheet'!$K$8,\"For populations of \"&'size classes'!C26,)))))","v":0},null,null,null,null,null,false,0,0,0]
[null,null,null,{"$f":"IF($D$5=0,,IF($D$5=$K$5,\"Medium\",IF($D$5=$K$6,\"Medium\",IF($D$5=$K$7,,IF($D$5=$K$8,\"Medium\",)))))","v":0},{"$f":"IF($D$5=0,,IF($D$5=$K$5,\"For populations of \"&'size classes'!C4,IF($D$5=$K$6,\"For populations of \"&'size classes'!C12,IF($D$5='Interactive Worksheet'!$K$7,,IF($D$5='Interactive Worksheet'!$K$8,\"For populations of \"&'size classes'!C27,)))))","v":0},null,null,null,null,null,false,0,0,0]
[null,null,null,{"$f":"IF($D$5=0,,IF($D$5=$K$5,\"Large\",IF($D$5=$K$6,\"Large\",IF($D$5=$K$7,,IF($D$5=$K$8,\"Large\",)))))","v":0},{"$f":"IF($D$5=0,,IF($D$5=$K$5,\"For populations of \"&'size classes'!C5,IF($D$5=$K$6,\"For populations of \"&'size classes'!C13,IF($D$5='Interactive Worksheet'!$K$7,,IF($D$5='Interactive Worksheet'!$K$8,\"For populations of \"&'size classes'!C28,)))))","v":0},null,null,null,null,null,false,0,0,0]
[null,null,null,{"$f":"IF($D$5=0,,IF($D$5=$K$5,\"Extra Large\",IF($D$5=$K$6,\"Extra Large\",IF($D$5=$K$7,,IF($D$5=$K$8,\"Extra Large\",)))))","v":0},{"$f":"IF($D$5=0,,IF($D$5=$K$5,\"For populations of \"&'size classes'!C6,IF($D$5=$K$6,\"For populations of \"&'size classes'!C14,IF($D$5='Interactive Worksheet'!$K$7,,IF($D$5='Interactive Worksheet'!$K$8,\"For populations of \"&'size classes'!C29,)))))","v":0},null,null,null,null,null,false,0,0,0]
[null,null,null,{"$f":"IF($D$5=0,,IF($D$5=$K$5,,IF($D$5=$K$6,,IF($D$5=$K$7,,IF($D$5=$K$8,\"Jumbo\",)))))","v":0},{"$f":"IF($D$5=0,,IF($D$5='Interactive Worksheet'!$K$8,\"For populations of \"&'size classes'!C30,))","v":0},null,null,null,null,null,false,0,{"$f":"IF(D5=K6,\"Jumbo\",D14)","v":0},{"$f":"IF(D5=K6, \"For populations of >30,000\",E14)","v":0}]
[null,null,null,{"$f":"IF($D$5=0,,IF(AND($D$5=$K$5,K13=TRUE),\"Additional\",IF($D$5=$K$6,\"Jumbo\",IF($D$5=$K$7,\"Additional\",IF($D$5=$K$8,,)))))","v":0},{"$f":"IF(D5=0,,IF(AND($D$5=$K$5,K13=TRUE),\"Enter additional population over 15,000\",IF(D5=K6,\"For populations over 30,000, enter  1  here:\",)))","v":0},null,null,{"$f":"IF(AND($D$5=$K$5,$G$15>0),\"( = \"&(M17*5000)&\")\",IF(AND($D$5=$K$7,$G$15>0),\"( = \"&Q17&\")\",0))","v":0},null,{"$f":"IF(G15<>0,\"G\",)","v":0},{"$f":"IF(SUM(L9:L14)>1,\"ERROR: Only select one facility size.  \",0)","v":0},{"$f":"IF(K15<>0,1,0)","v":0},"Army",null,"Navy",null,"AF",null,"MC",null,"Locker"]
[null,{"$f":"IF(AND($D$5=$K$8,SUM(L9:L14)=0),\"Check box AND enter total Installation population in space provided\",0)","v":0},null,{"$f":"IF(D5=0,,IF(AND(D5=K8,AND(K13<>TRUE,K14<>TRUE)),\"Enter actual total population:\",IF(AND(D5=K8,OR(K13=TRUE,K14=TRUE)),\"For Extra Large or Jumbo populations program multiple, smaller facilities.\",)))","v":0},null,null,null,null,null,{"$f":"IF(G16<>0,\"G\",)","v":0},{"$f":"IF(AND(D5=K6,SUM(L9:L13)=1,O18>0),\"  ERROR: Only select one facility size.  If 'Jumbo,' uncheck other boxes.  \",0)","v":0},{"$f":"IF(K16<>0,1,0)","v":0}]
[null,null,null,null,{"$f":"IF(AND(D5=K8,OR(K13=TRUE,K14=TRUE)),\"Contact HQMC MRS/MRD for more information.\",)","v":0},null,null,null,null,null,{"$f":"IF(D5=K5,IF(AND(K13=FALSE,G15>0),\"  ERROR: Must select 'Extra Large' size before adding additional population.  \",),IF(D5=K7,IF(AND(K12=FALSE,G15>0),\"  ERROR: Must select 'Large' size before adding additional population.  \",0),0))","v":0},{"$f":"IF(K17<>0,1,0)","v":0},{"$f":"ROUNDUP((G15/5000),0)","v":0},{"$f":"15000+G15","v":15000},{"$f":"D15","v":0},{"$f":"\"For populations of \"&'size classes'!C15","v":"For populations of >30,000"},{"$f":"ROUNDUP(G15,-3)","v":0},{"$f":"6000+G15","v":6000},{"$f":"IF($K$9=TRUE,1,IF($K$10=TRUE,501,IF($K$11=TRUE,3001,IF($K$12=TRUE,7001,IF($K$13=TRUE,14001,)))))","v":0},{"$f":"IF($K$9=TRUE,500,IF($K$10=TRUE,3000,IF($K$11=TRUE,7000,IF($K$12=TRUE,14000,IF($K$13=TRUE,30000,)))))","v":0}]
[{"$f":"\"\"&K15&\"\"&K16&\"\"&K17&\"\"&K18","v":"0000"},null,null,null,null,null,null,null,null,null,{"$f":"IF(AND($D$5=$K$8,B16=0,$G$16<>0,OR($G$16<$S$17,$G$16>$T$17)),\"  ERROR: Total population entered does not correspond to facility size selected.  Total population should be between \"&$S$17&\" and \"&$T$17,0)","v":0},{"$f":"IF(K18<>0,1,0)","v":0},null,{"$f":"15000+(M17*5000)","v":15000},{"$f":"G15","v":0},null,null,{"$f":"6000+Q17","v":6000}]
[]
[null,null,null,null,null,null,null,null,null,null,null,null,"Army formulas contain an element to capture quantities and space for the additional 5K population modules.",null,"Navy formulas contain an element to capture quantities and space for the Jumbo size."]
[{"$f":"IF(D5=0,,\"Based on data entered above, facility size basis is:\")","v":0},null,null,{"$f":"IF(AND(D5=K6,O18>0),O17,VLOOKUP(TRUE,K9:M13,3,FALSE))","v":{"$error":"#N/A"}},{"$f":"IF(AND(D5=K6,O18>0),P17,VLOOKUP(TRUE,K9:P13,4,FALSE))","v":{"$error":"#N/A"}},null,null,null,null,null,{"$f":"ISERROR(D21)","v":true}]
[null,null,null,{"$f":"IF($D$5=0,,IF(AND($D$5=$K$5,$G$15>0),\"Additional population entered:\",IF(AND($D$5=$K$5,K13=TRUE),\"No additional population has been entered.\",0)))","v":0}]
[null,null,null,{"$f":"IF($D$5=0,,IF(AND($D$5=$K$5,$G$15>0),\"Total Installation population is   \"&N17,IF($D$5=$K$8,\"Total Installation population is \",)))","v":0}]
[null,null,null,{"$f":"IF($D$5=0,,IF(AND($D$5=$K$5,$G$15>0),\"Facility will be sized based on population of\",))","v":0},null,null,{"$f":"IF($D$5=0,,IF(AND($D$5=$K$5,$G$15>0),N18,0))","v":0}]
[]
[{"$f":"IF(D5=0,,IF(AND(D5<>0,SUM(L9:L14)=1,D26=0),\"3.  Confirm facility size basis is correct (yes or no):\",\"Facility Size Confirmed:\"))","v":0},null,null,null,{"$f":"IF(D5=0,,IF(K26=\"No\",\"Must check box next to appropriate size before indicating 'Yes.'\",IF(K26=\"No \",\"Resolve error message(s) above before indicating 'Yes.'\",IF(K26=\"No  \",\"Must check size box AND enter total Installation population in space provided before indicating 'Yes.'\",))))","v":0},null,null,null,null,{"$f":"IF(D26<>0,\"D\",)","v":0},{"$f":"IF(D5=K7,\"No\",IF(AND(D5<>K6,SUM(L9:L13)<1),\"No\",IF(AND(D5=K6,SUM(L9:L13)<1,O18<1),\"No\",IF(SUM(L15:L18)>0,\"No \",IF(B16<>0,\"No  \",\"Yes\")))))","v":"No"}]
[null,null,null,null,null,null,null,null,null,null,"No"]
[]
[]
[{"$f":"IF(D5=0,,IF(OR(D26<>\"Yes\",D26=0,K26<>\"Yes\"),\"Must confirm facility size basis is correct (Yes) above before proceeding.  If facility size basis is not correct, or if 'Yes' is not an option, adjust the figures accordingly.  Refer to UFC Section 2-1 and its referenced documents for more information.\",\"Many of the spaces below are determined by the size and/or population criteria confirmed above.  Where appropriate or necessary, modify each space or select the appropriate options to determine the total net facility size.\"))","v":0}]
[]
[]
[{"$f":"IF(OR(D26<>\"Yes\",D26=0,K26<>\"Yes\"),,'Components and Space Standards'!A3)","v":0},null,null,null,"Default quantities",null," m2","ft.2",null,null,9.2899999999999996E-2]
[{"$f":"IF(OR($D$26<>\"Yes\",$D$26=0,$K$26<>\"Yes\"),,'Components and Space Standards'!A4)","v":0},null,null,null,null,null,null,null,null,null,null,null,"Units","SF","Units","SF","Units","SF","Units","SF","Lockers"]
[{"$f":"IF(OR($D$26<>\"Yes\",$D$26=0,$K$26<>\"Yes\"),,'Components and Space Standards'!A5)","v":0},null,null,null,{"$f":"IF(OR($D$26<>\"Yes\",$D$26=0,$K$26<>\"Yes\"),,IF($D$5=$K$5,M35&\" \"&'Components and Space Standards'!D5&\".\",IF($D$5=$K$6,O35&\" \"&'Components and Space Standards'!D5&\".\",IF($D$5=$K$7,Q35&\" \"&'Components and Space Standards'!D5&\".\",IF($D$5=$K$8,S35&\" \"&'Components and Space Standards'!D5&\".\",)))))","v":0},null,{"$f":"ROUND(H35*$K$33,2)","v":0},{"$f":"IF(OR($D$26<>\"Yes\",$D$26=0,$K$26<>\"Yes\"),,IF($D$5=$K$5,N35,IF($D$5=$K$6,P35,IF($D$5=$K$7,R35,IF($D$5=$K$8,T35,)))))","v":0},null,null,{"$f":"IF(H43=0,\"Requires gym\",\"Yes\")","v":"Requires gym"},null,{"$f":"IF($D35<>0,$D35,IF($D$21=$M$9,Army!$F5,IF($D$21=$M$10,Army!$I5,IF($D$21='Interactive Worksheet'!$M$11,Army!$L5,IF($D$21='Interactive Worksheet'!$M$12,Army!$O5,IF($D$21='Interactive Worksheet'!$M$13,IF($M$17=0,Army!$R5,($M$17*Army!U5)+Army!R5)))))))","v":{"$error":"#N/A"}},{"$f":"IF($D35<>0,$D35*'Components and Space Standards'!$C5,IF($D$21=$M$9,Army!$H5,IF($D$21=$M$10,Army!$K5,IF($D$21='Interactive Worksheet'!$M$11,Army!$N5,IF($D$21='Interactive Worksheet'!$M$12,Army!$Q5,IF($D$21='Interactive Worksheet'!$M$13,IF($M$17=0,Army!$T5,($M$17*Army!W5)+Army!T5)))))))","v":{"$error":"#N/A"}},{"$f":"IF($D$35<>0,$D$35,IF($D$21=$M$9,Navy!F5,IF($D$21=$M$10,Navy!I5,IF($D$21='Interactive Worksheet'!$M$11,Navy!L5,IF($D$21='Interactive Worksheet'!$M$12,Navy!O5,IF($D$21='Interactive Worksheet'!$M$13,Navy!R5,IF($O$18>0,Navy!U5,)))))))","v":{"$error":"#N/A"}},{"$f":"IF($D$35<>0,$D$35*'Components and Space Standards'!C5,IF($D$21=$M$9,Navy!H5,IF($D$21=$M$10,Navy!K5,IF($D$21='Interactive Worksheet'!$M$11,Navy!N5,IF($D$21='Interactive Worksheet'!$M$12,Navy!Q5,IF($D$21='Interactive Worksheet'!$M$13,Navy!T5,IF($O$18>0,Navy!W5,)))))))","v":{"$error":"#N/A"}},{"$f":"IF(D35<>0,D35,IF($D$21=$M$10,AF!F5,IF($D$21=$M$11,AF!I5,IF($D$21='Interactive Worksheet'!$M$12,AF!L5,))))","v":{"$error":"#N/A"}},{"$f":"IF(D35<>0,D35*'Components and Space Standards'!C5,IF($D$21=$M$10,AF!H5,IF($D$21=$M$11,AF!K5,IF($D$21='Interactive Worksheet'!$M$12,AF!N5,))))","v":{"$error":"#N/A"}},{"$f":"IF($D35<>0,$D35,IF($D$21=$M$9,MC!F5,IF($D$21=$M$10,MC!I5,IF($D$21='Interactive Worksheet'!$M$11,MC!L5,IF($D$21='Interactive Worksheet'!$M$12,MC!O5,IF($D$21='Interactive Worksheet'!$M$13,MC!R5,))))))","v":{"$error":"#N/A"}},{"$f":"IF($D35<>0,$D35*'Components and Space Standards'!C5,IF($D$21=$M$9,MC!H5,IF($D$21=$M$10,MC!K5,IF($D$21='Interactive Worksheet'!$M$11,MC!N5,IF($D$21='Interactive Worksheet'!$M$12,MC!Q5,IF($D$21='Interactive Worksheet'!$M$13,MC!T5,))))))","v":{"$error":"#N/A"}}]
[{"$f":"IF(OR($D$26<>\"Yes\",$D$26=0,$K$26<>\"Yes\"),,'Components and Space Standards'!A6)","v":0},null,null,null,{"$f":"IF(OR($D$26<>\"Yes\",$D$26=0,$K$26<>\"Yes\"),,IF($D$5=$K$5,M36&\" \"&'Components and Space Standards'!D6&\".\",IF($D$5=$K$6,O36&\" \"&'Components and Space Standards'!D6&\".\",IF($D$5=$K$7,Q36&\" \"&'Components and Space Standards'!D6&\".\",IF($D$5=$K$8,S36&\" \"&'Components and Space Standards'!D6&\".\",)))))","v":0},null,{"$f":"ROUND(H36*$K$33,2)","v":0},{"$f":"IF(OR($D$26<>\"Yes\",$D$26=0,$K$26<>\"Yes\"),,IF($D$5=$K$5,N36,IF($D$5=$K$6,P36,IF($D$5=$K$7,R36,IF($D$5=$K$8,T36,)))))","v":0},null,null,"No",null,{"$f":"IF($D36<>0,$D36,IF($D$21=$M$9,Army!$F6,IF($D$21=$M$10,Army!$I6,IF($D$21='Interactive Worksheet'!$M$11,Army!$L6,IF($D$21='Interactive Worksheet'!$M$12,Army!$O6,IF($D$21='Interactive Worksheet'!$M$13,IF($M$17=0,Army!$R6,($M$17*Army!U6)+Army!R6)))))))","v":{"$error":"#N/A"}},{"$f":"IF($D36<>0,$D36*'Components and Space Standards'!$C6,IF($D$21=$M$9,Army!$H6,IF($D$21=$M$10,Army!$K6,IF($D$21='Interactive Worksheet'!$M$11,Army!$N6,IF($D$21='Interactive Worksheet'!$M$12,Army!$Q6,IF($D$21='Interactive Worksheet'!$M$13,IF($M$17=0,Army!$T6,($M$17*Army!W6)+Army!T6)))))))","v":{"$error":"#N/A"}},{"$f":"IF($D$35<>0,$D$35,IF($D$21=$M$9,Navy!F6,IF($D$21=$M$10,Navy!I6,IF($D$21='Interactive Worksheet'!$M$11,Navy!L6,IF($D$21='Interactive Worksheet'!$M$12,Navy!O6,IF($D$21='Interactive Worksheet'!$M$13,Navy!R6,IF($O$18>0,Navy!U6,)))))))","v":{"$error":"#N/A"}},{"$f":"IF($D$35<>0,$D$35*'Components and Space Standards'!C6,IF($D$21=$M$9,Navy!H6,IF($D$21=$M$10,Navy!K6,IF($D$21='Interactive Worksheet'!$M$11,Navy!N6,IF($D$21='Interactive Worksheet'!$M$12,Navy!Q6,IF($D$21='Interactive Worksheet'!$M$13,Navy!T6,IF($O$18>0,Navy!W6,)))))))","v":{"$error":"#N/A"}},{"$f":"IF(D36<>0,D36,IF($D$21=$M$10,AF!F6,IF($D$21=$M$11,AF!I6,IF($D$21='Interactive Worksheet'!$M$12,AF!L6,))))","v":{"$error":"#N/A"}},{"$f":"IF(D36<>0,D36*'Components and Space Standards'!C6,IF($D$21=$M$10,AF!H6,IF($D$21=$M$11,AF!K6,IF($D$21='Interactive Worksheet'!$M$12,AF!N6,))))","v":{"$error":"#N/A"}},{"$f":"IF($D36<>0,$D36,IF($D$21=$M$9,MC!F6,IF($D$21=$M$10,MC!I6,IF($D$21='Interactive Worksheet'!$M$11,MC!L6,IF($D$21='Interactive Worksheet'!$M$12,MC!O6,IF($D$21='Interactive Worksheet'!$M$13,MC!R6,))))))","v":{"$error":"#N/A"}},{"$f":"IF($D36<>0,$D36*'Components and Space Standards'!C6,IF($D$21=$M$9,MC!H6,IF($D$21=$M$10,MC!K6,IF($D$21='Interactive Worksheet'!$M$11,MC!N6,IF($D$21='Interactive Worksheet'!$M$12,MC!Q6,IF($D$21='Interactive Worksheet'!$M$13,MC!T6,))))))","v":{"$error":"#N/A"}},2]
[{"$f":"IF(OR($D$26<>\"Yes\",$D$26=0,$K$26<>\"Yes\"),,'Components and Space Standards'!A7)","v":0},null,null,null,{"$f":"IF(OR($D$26<>\"Yes\",$D$26=0,$K$26<>\"Yes\"),,IF($D$5=$K$5,M37&\" \"&'Components and Space Standards'!D7&\".\",IF($D$5=$K$6,O37&\" \"&'Components and Space Standards'!D7&\".\",IF($D$5=$K$7,Q37&\" \"&'Components and Space Standards'!D7&\".\",IF($D$5=$K$8,S37&\" \"&'Components and Space Standards'!D7&\".\",)))))","v":0},null,0,0,null,null,null,null,{"$f":"IF($D37<>0,$D37,IF($D$21=$M$9,Army!$F7,IF($D$21=$M$10,Army!$I7,IF($D$21='Interactive Worksheet'!$M$11,Army!$L7,IF($D$21='Interactive Worksheet'!$M$12,Army!$O7,IF($D$21='Interactive Worksheet'!$M$13,IF($M$17=0,Army!$R7,($M$17*Army!U7)+Army!R7)))))))","v":{"$error":"#N/A"}},{"$f":"IF($D37<>0,$D37*'Components and Space Standards'!$C7,IF($D$21=$M$9,Army!$H7,IF($D$21=$M$10,Army!$K7,IF($D$21='Interactive Worksheet'!$M$11,Army!$N7,IF($D$21='Interactive Worksheet'!$M$12,Army!$Q7,IF($D$21='Interactive Worksheet'!$M$13,IF($M$17=0,Army!$T7,($M$17*Army!W7)+Army!T7)))))))","v":{"$error":"#N/A"}},{"$f":"IF($D$35<>0,$D$35,IF($D$21=$M$9,Navy!F7,IF($D$21=$M$10,Navy!I7,IF($D$21='Interactive Worksheet'!$M$11,Navy!L7,IF($D$21='Interactive Worksheet'!$M$12,Navy!O7,IF($D$21='Interactive Worksheet'!$M$13,Navy!R7,IF($O$18>0,Navy!U7,)))))))","v":{"$error":"#N/A"}},{"$f":"IF($D$35<>0,$D$35*'Components and Space Standards'!C7,IF($D$21=$M$9,Navy!H7,IF($D$21=$M$10,Navy!K7,IF($D$21='Interactive Worksheet'!$M$11,Navy!N7,IF($D$21='Interactive Worksheet'!$M$12,Navy!Q7,IF($D$21='Interactive Worksheet'!$M$13,Navy!T7,IF($O$18>0,Navy!W7,)))))))","v":{"$error":"#N/A"}},{"$f":"IF(D37<>0,D37,IF($D$21=$M$10,AF!F7,IF($D$21=$M$11,AF!I7,IF($D$21='Interactive Worksheet'!$M$12,AF!L7,))))","v":{"$error":"#N/A"}},{"$f":"IF(D37<>0,D37*'Components and Space Standards'!C7,IF($D$21=$M$10,AF!H7,IF($D$21=$M$11,AF!K7,IF($D$21='Interactive Worksheet'!$M$12,AF!N7,))))","v":{"$error":"#N/A"}},{"$f":"IF($D37<>0,$D37,IF($D$21=$M$9,MC!F7,IF($D$21=$M$10,MC!I7,IF($D$21='Interactive Worksheet'!$M$11,MC!L7,IF($D$21='Interactive Worksheet'!$M$12,MC!O7,IF($D$21='Interactive Worksheet'!$M$13,MC!R7,))))))","v":{"$error":"#N/A"}},{"$f":"IF($D37<>0,$D37*'Components and Space Standards'!C7,IF($D$21=$M$9,MC!H7,IF($D$21=$M$10,MC!K7,IF($D$21='Interactive Worksheet'!$M$11,MC!N7,IF($D$21='Interactive Worksheet'!$M$12,MC!Q7,IF($D$21='Interactive Worksheet'!$M$13,MC!T7,))))))","v":{"$error":"#N/A"}}]
[{"$f":"IF(OR($D$26<>\"Yes\",$D$26=0,$K$26<>\"Yes\"),,'Components and Space Standards'!A8)","v":0},null,null,null,{"$f":"IF(OR($D$26<>\"Yes\",$D$26=0,$K$26<>\"Yes\"),,IF($D$5=$K$5,M38&\" \"&'Components and Space Standards'!D8&\".\",IF($D$5=$K$6,O38&\" \"&'Components and Space Standards'!D8&\".\",IF($D$5=$K$7,Q38&\" \"&'Components and Space Standards'!D8&\".\",IF($D$5=$K$8,S38&\" \"&'Components and Space Standards'!D8&\".\",)))))","v":0},null,0,0,null,null,{"$f":"\"1 unisex\"","v":"1 unisex"},null,{"$f":"IF($D38<>0,$D38,IF($D$21=$M$9,Army!$F8,IF($D$21=$M$10,Army!$I8,IF($D$21='Interactive Worksheet'!$M$11,Army!$L8,IF($D$21='Interactive Worksheet'!$M$12,Army!$O8,IF($D$21='Interactive Worksheet'!$M$13,IF($M$17=0,Army!$R8,($M$17*Army!U8)+Army!R8)))))))","v":{"$error":"#N/A"}},{"$f":"IF($D38<>0,$D38*'Components and Space Standards'!$C8,IF($D$21=$M$9,Army!$H8,IF($D$21=$M$10,Army!$K8,IF($D$21='Interactive Worksheet'!$M$11,Army!$N8,IF($D$21='Interactive Worksheet'!$M$12,Army!$Q8,IF($D$21='Interactive Worksheet'!$M$13,IF($M$17=0,Army!$T8,($M$17*Army!W8)+Army!T8)))))))","v":{"$error":"#N/A"}},{"$f":"IF($D$35<>0,$D$35,IF($D$21=$M$9,Navy!F8,IF($D$21=$M$10,Navy!I8,IF($D$21='Interactive Worksheet'!$M$11,Navy!L8,IF($D$21='Interactive Worksheet'!$M$12,Navy!O8,IF($D$21='Interactive Worksheet'!$M$13,Navy!R8,IF($O$18>0,Navy!U8,)))))))","v":{"$error":"#N/A"}},{"$f":"IF($D$35<>0,$D$35*'Components and Space Standards'!C8,IF($D$21=$M$9,Navy!H8,IF($D$21=$M$10,Navy!K8,IF($D$21='Interactive Worksheet'!$M$11,Navy!N8,IF($D$21='Interactive Worksheet'!$M$12,Navy!Q8,IF($D$21='Interactive Worksheet'!$M$13,Navy!T8,IF($O$18>0,Navy!W8,)))))))","v":{"$error":"#N/A"}},{"$f":"IF(D38<>0,D38,IF($D$21=$M$10,AF!F8,IF($D$21=$M$11,AF!I8,IF($D$21='Interactive Worksheet'!$M$12,AF!L8,))))","v":{"$error":"#N/A"}},{"$f":"IF(D38<>0,D38*'Components and Space Standards'!C8,IF($D$21=$M$10,AF!H8,IF($D$21=$M$11,AF!K8,IF($D$21='Interactive Worksheet'!$M$12,AF!N8,))))","v":{"$error":"#N/A"}},{"$f":"IF($D38<>0,$D38,IF($D$21=$M$9,MC!F8,IF($D$21=$M$10,MC!I8,IF($D$21='Interactive Worksheet'!$M$11,MC!L8,IF($D$21='Interactive Worksheet'!$M$12,MC!O8,IF($D$21='Interactive Worksheet'!$M$13,MC!R8,))))))","v":{"$error":"#N/A"}},{"$f":"IF($D38<>0,$D38*'Components and Space Standards'!C8,IF($D$21=$M$9,MC!H8,IF($D$21=$M$10,MC!K8,IF($D$21='Interactive Worksheet'!$M$11,MC!N8,IF($D$21='Interactive Worksheet'!$M$12,MC!Q8,IF($D$21='Interactive Worksheet'!$M$13,MC!T8,))))))","v":{"$error":"#N/A"}}]
[{"$f":"IF(OR($D$26<>\"Yes\",$D$26=0,$K$26<>\"Yes\"),,'Components and Space Standards'!A9)","v":0},null,null,null,{"$f":"IF(OR($D$26<>\"Yes\",$D$26=0,$K$26<>\"Yes\"),,IF($D$5=$K$5,M39&\" \"&'Components and Space Standards'!D9&\".\",IF($D$5=$K$6,O39&\" \"&'Components and Space Standards'!D9&\".\",IF($D$5=$K$7,Q39&\" \"&'Components and Space Standards'!D9&\".\",IF($D$5=$K$8,S39&\" \"&'Components and Space Standards'!D9&\".\",)))))","v":0},null,0,{"$f":"IF(OR($D$26<>\"Yes\",$D$26=0,$K$26<>\"Yes\"),,IF($D$5=$K$5,N39,IF($D$5=$K$6,P39,IF($D$5=$K$7,R39,IF($D$5=$K$8,T39,)))))","v":0},null,null,{"$f":"IF(OR((K50+L50)>200,(AND(D5=K5,N17>15000))),\"1 male/ 1 female\",0)","v":0},null,{"$f":"IF($D39<>0,$D39,IF($D$21=$M$9,Army!$F9,IF($D$21=$M$10,Army!$I9,IF($D$21='Interactive Worksheet'!$M$11,Army!$L9,IF($D$21='Interactive Worksheet'!$M$12,Army!$O9,IF($D$21='Interactive Worksheet'!$M$13,IF($M$17=0,Army!$R9,($M$17*Army!U9)+Army!R9)))))))","v":{"$error":"#N/A"}},{"$f":"IF($D39<>0,$D39*'Components and Space Standards'!$C9,IF($D$21=$M$9,Army!$H9,IF($D$21=$M$10,Army!$K9,IF($D$21='Interactive Worksheet'!$M$11,Army!$N9,IF($D$21='Interactive Worksheet'!$M$12,Army!$Q9,IF($D$21='Interactive Worksheet'!$M$13,IF($M$17=0,Army!$T9,($M$17*Army!W9)+Army!T9)))))))","v":{"$error":"#N/A"}},{"$f":"IF($D$35<>0,$D$35,IF($D$21=$M$9,Navy!F9,IF($D$21=$M$10,Navy!I9,IF($D$21='Interactive Worksheet'!$M$11,Navy!L9,IF($D$21='Interactive Worksheet'!$M$12,Navy!O9,IF($D$21='Interactive Worksheet'!$M$13,Navy!R9,IF($O$18>0,Navy!U9,)))))))","v":{"$error":"#N/A"}},{"$f":"IF($D$35<>0,$D$35*'Components and Space Standards'!C9,IF($D$21=$M$9,Navy!H9,IF($D$21=$M$10,Navy!K9,IF($D$21='Interactive Worksheet'!$M$11,Navy!N9,IF($D$21='Interactive Worksheet'!$M$12,Navy!Q9,IF($D$21='Interactive Worksheet'!$M$13,Navy!T9,IF($O$18>0,Navy!W9,)))))))","v":{"$error":"#N/A"}},{"$f":"IF(D39<>0,D39,IF($D$21=$M$10,AF!F9,IF($D$21=$M$11,AF!I9,IF($D$21='Interactive Worksheet'!$M$12,AF!L9,))))","v":{"$error":"#N/A"}},{"$f":"IF(D39<>0,D39*'Components and Space Standards'!C9,IF($D$21=$M$10,AF!H9,IF($D$21=$M$11,AF!K9,IF($D$21='Interactive Worksheet'!$M$12,AF!N9,))))","v":{"$error":"#N/A"}},{"$f":"IF($D39<>0,$D39,IF($D$21=$M$9,MC!F9,IF($D$21=$M$10,MC!I9,IF($D$21='Interactive Worksheet'!$M$11,MC!L9,IF($D$21='Interactive Worksheet'!$M$12,MC!O9,IF($D$21='Interactive Worksheet'!$M$13,MC!R9,))))))","v":{"$error":"#N/A"}},{"$f":"IF($D39<>0,$D39*'Components and Space Standards'!C9,IF($D$21=$M$9,MC!H9,IF($D$21=$M$10,MC!K9,IF($D$21='Interactive Worksheet'!$M$11,MC!N9,IF($D$21='Interactive Worksheet'!$M$12,MC!Q9,IF($D$21='Interactive Worksheet'!$M$13,MC!T9,))))))","v":{"$error":"#N/A"}}]
[{"$f":"IF(OR($D$26<>\"Yes\",$D$26=0,$K$26<>\"Yes\"),,'Components and Space Standards'!A10)","v":0},null,{"$f":"IF(OR($D$26<>\"Yes\",$D$26=0,$K$26<>\"Yes\"),,\"For this option, select yes or no:\")","v":0},null,{"$f":"IF(OR($D$26<>\"Yes\",$D$26=0,$K$26<>\"Yes\"),,IF($D$5=$K$5,M40&\" \"&'Components and Space Standards'!D10&\".\",IF($D$5=$K$6,O40&\" \"&'Components and Space Standards'!D10&\".\",IF($D$5=$K$7,Q40&\" \"&'Components and Space Standards'!D10&\".\",IF($D$5=$K$8,S40&\" \"&'Components and Space Standards'!D10&\".\",)))))","v":0},null,0,{"$f":"IF(OR($D$26<>\"Yes\",$D$26=0,$K$26<>\"Yes\"),,IF($D$5=$K$5,N40,IF($D$5=$K$6,P40,IF($D$5=$K$7,R40,IF($D$5=$K$8,T40,)))))","v":0},null,{"$f":"IF(D40<>0,\"D\",)","v":0},{"$f":"IF(OR((K50+L50)>400,(AND(D5=K5,N17>15000))),\"2 male/ 3 female\",0)","v":0},null,{"$f":"IF($D$40=$K$35,($K$50+$L$50)/200,0)","v":0},{"$f":"IF($D$40=$K$35,M$40*'Components and Space Standards'!$C$10,0)","v":0},{"$f":"IF($D$40=$K$35,($K$50+$L$50)/200,0)","v":0},{"$f":"IF($D$40=$K$35,O$40*'Components and Space Standards'!$C$10,0)","v":0},{"$f":"IF($D$40=$K$35,($K$50+$L$50)/200,0)","v":0},{"$f":"IF($D$40=$K$35,Q$40*'Components and Space Standards'!$C$10,0)","v":0},{"$f":"IF($D$40=$K$35,($K$50+$L$50)/200,0)","v":0},{"$f":"IF($D$40=$K$35,S$40*'Components and Space Standards'!$C$10,0)","v":0},null,null,"Select \"Yes\" to get 300 sf for every 200 gym seats. Need to have a gym."]
[{"$f":"IF(OR($D$26<>\"Yes\",$D$26=0,$K$26<>\"Yes\"),,'Components and Space Standards'!A11)","v":0},null,{"$f":"IF(OR($D$26<>\"Yes\",$D$26=0,$K$26<>\"Yes\"),,\"For this option, select size of restroom:\")","v":0},null,{"$f":"IF(OR($D$26<>\"Yes\",$D$26=0,$K$26<>\"Yes\"),,IF($D$5=$K$5,M41&\" \"&'Components and Space Standards'!D11&\".\",IF($D$5=$K$6,O41&\" \"&'Components and Space Standards'!D11&\".\",IF($D$5=$K$7,Q41&\" \"&'Components and Space Standards'!D11&\".\",IF($D$5=$K$8,S41&\" \"&'Components and Space Standards'!D11&\".\",)))))","v":0},null,0,0,null,{"$f":"IF(D41<>0,\"D\",)","v":0},{"$f":"IF(OR((K50+L50)>600,(AND(D5=K5,N17>15000))),\"4 male/ 6 female\",0)","v":0},null,{"$f":"$D$41","v":0},{"$f":"IF($D$41=0,0,IF($D$41=$K$38,48,IF($D$41=$K$39,(48+48),IF($D$41=$K$40,((45*2)+(45*3)),IF($D$41=$K$41,((45*4)+(45*6)),0)))))","v":0},{"$f":"$D$41","v":0},{"$f":"IF($D$41=0,0,IF($D$41=$K$38,48,IF($D$41=$K$39,(48+48),IF($D$41=$K$40,((45*2)+(45*3)),IF($D$41=$K$41,((45*4)+(45*6)),0)))))","v":0},{"$f":"$D$41","v":0},{"$f":"IF($D$41=0,0,IF($D$41=$K$38,48,IF($D$41=$K$39,(48+48),IF($D$41=$K$40,((45*2)+(45*3)),IF($D$41=$K$41,((45*4)+(45*6)),0)))))","v":0},{"$f":"$D$41","v":0},{"$f":"IF($D$41=0,0,IF($D$41=$K$38,48,IF($D$41=$K$39,(48+48),IF($D$41=$K$40,((45*2)+(45*3)),IF($D$41=$K$41,((45*4)+(45*6)),0)))))","v":0},null,null,"This option is tied to the number of potential spectators. The more gym seats you have, the larger the bathroom option you can choose. "]
[{"$f":"IF(OR($D$26<>\"Yes\",$D$26=0,$K$26<>\"Yes\"),,'Components and Space Standards'!A12)","v":0},null,null,null,"Default quantities",null," m2","ft.2",null,null,"Rows 45 - 48 are hidden and contain the default data for the two-court and arena-style court options (47&48) and the non-default data for the Arena-style (45) and 4-court option (46--unused).  If the default is altered, the yellow cells become active.  The grey cell formulas have been modified to accommodate the non-default, yellow options--do not copy to other rows.",null,null,null,null,null,null,null,null,null,{"$f":"S45*20","v":0}]
[{"$f":"IF(OR($D$26<>\"Yes\",$D$26=0,$K$26<>\"Yes\"),,'Components and Space Standards'!A13)","v":0},null,{"$f":"IF(OR($D$26<>\"Yes\",$D$26=0,$K$26<>\"Yes\"),,\"Select size:\")","v":0},null,{"$f":"IF(AND($D$43<>0,D5=K8),$Q$44,IF(AND(D5=K5,N17>15000),\"For populations over 30K, use the Army Quantity Questionnaire (see UFC 2-1.1) to determine gym needs on an Installation-wide basis.\",IF(H43='Components and Space Standards'!C13,L43,IF(H43='Components and Space Standards'!C14,L48,IF(H43='Components and Space Standards'!C15,L49,IF(H43=('Components and Space Standards'!C13+'Components and Space Standards'!C15),L43&\" and \"&L49,IF(H43=('Components and Space Standards'!C14+'Components and Space Standards'!C15),L48&\" and \"&L49,IF(H43=('Components and Space Standards'!C13+'Components and Space Standards'!C14+'Components and Space Standards'!C15),Q45,Q45))))))))","v":0},null,{"$f":"ROUND(H43*$K$33,2)","v":0},{"$f":"IF(AND(D5=K8,$D$43<>0),$R$44,IF(AND(D5=K5,N17>15000),0,(K43+K48+K49)))","v":0},null,{"$f":"IF(D43<>0,\"D\",)","v":0},{"$f":"IF(OR($D$26<>\"Yes\",$D$26=0,$K$26<>\"Yes\"),,IF($D$5=$K$5,N43,IF($D$5=$K$6,P43,IF($D$5=$K$7,R43,IF($D$5=$K$8,T43,)))))","v":0},{"$f":"IF(OR($D$26<>\"Yes\",$D$26=0,$K$26<>\"Yes\"),,IF($D$5=$K$5,$M43&\" \"&'Components and Space Standards'!$D13&\".\",IF($D$5=$K$6,$O43&\" \"&'Components and Space Standards'!$D13&\".\",IF($D$5=$K$7,$Q43&\" \"&'Components and Space Standards'!$D13&\".\",IF($D$5=$K$8,$S43&\" \"&'Components and Space Standards'!$D13&\".\",)))))","v":0},{"$f":"IF($D$21=$M$9,Army!$F13,IF($D$21=$M$10,Army!$I13,IF($D$21='Interactive Worksheet'!$M$11,Army!$L13,IF($D$21='Interactive Worksheet'!$M$12,Army!$O13,IF($D$21='Interactive Worksheet'!$M$13,Army!$R13,)))))","v":{"$error":"#N/A"}},{"$f":"IF($D$21=$M$9,Army!$H13,IF($D$21=$M$10,Army!$K13,IF($D$21='Interactive Worksheet'!$M$11,Army!$N13,IF($D$21='Interactive Worksheet'!$M$12,Army!$Q13,IF($D$21='Interactive Worksheet'!$M$13,Army!$T13,)))))","v":{"$error":"#N/A"}},{"$f":"IF($D$21=$M$9,Navy!$F13,IF($D$21=$M$10,Navy!$I13,IF($D$21='Interactive Worksheet'!$M$11,Navy!$L13,IF($D$21='Interactive Worksheet'!$M$12,Navy!$O13,IF($D$21='Interactive Worksheet'!$M$13,Navy!$R13,IF($O$18>0,Navy!U13,))))))","v":{"$error":"#N/A"}},{"$f":"IF($D$21=$M$9,Navy!$H13,IF($D$21=$M$10,Navy!$K13,IF($D$21=$M$11,Navy!$N13,IF($D$21=$M$12,Navy!$Q13,IF($D$21=$M$13,Navy!$T13,IF($O$18>0,Navy!W13,))))))","v":{"$error":"#N/A"}},{"$f":"IF(D43<>0,\"See E45\",IF($D$21=$M$10,AF!F13,IF($D$21=$M$11,AF!I13,IF($D$21='Interactive Worksheet'!$M$12,AF!L13,))))","v":{"$error":"#N/A"}},{"$f":"IF($D$43<>0,\"See E45\",IF($D$21=$M$10,AF!H13,IF($D$21=$M$11,AF!K13,IF($D$21=$M$12,AF!N13,))))","v":{"$error":"#N/A"}},null,null,null,null,"See UFC Section B-1 for a complete description of the court modules."]
[{"$f":"IF(OR($D$26<>\"Yes\",$D$26=0,$K$26<>\"Yes\"),,\"Select the Basketball/volleyball Court size.  The selected size will be described to the right.\")","v":0},null,null,null,null,null,null,null,null,null,"One Court",{"$f":"\"1 \"&'Components and Space Standards'!D13","v":"1 One-court/200-seat Module(s)"},null,null,null,{"$f":"'Components and Space Standards'!C13","v":8892},{"$f":"IF($D$43=K44,L44,IF(D43=K45,L45,IF(D43=K46,L46,IF(D43=K47,L47,))))","v":0},{"$f":"IF($D$43=K44,P44,IF(D43=K45,P45,IF(D43=K46,P46,IF(D43=K47,P47,))))","v":0}]
[null,null,null,null,null,null,null,null,null,null,"Two Courts",{"$f":"\"1 \"&'Components and Space Standards'!D14","v":"1 Two-court/200-seat Module(s)"},null,null,null,{"$f":"'Components and Space Standards'!C14","v":17556},{"$f":"IF(H43=('Components and Space Standards'!C13+'Components and Space Standards'!C14+'Components and Space Standards'!C15),L43&\" and \"&L48&\" and \"&L49,IF(H43=('Components and Space Standards'!C13+'Components and Space Standards'!C14),L43&\" and \"&L48,IF(H43='Components and Space Standards'!C14*2,L48,IF(H43='Components and Space Standards'!C14*3,L48,))))","v":0},null,{"$f":"IF(H43='Components and Space Standards'!C13,1,IF(H43='Components and Space Standards'!C14,2,IF(H43='Components and Space Standards'!C15,2,IF(H43=('Components and Space Standards'!C13+'Components and Space Standards'!C15),3,IF(H43=('Components and Space Standards'!C14+'Components and Space Standards'!C15),4,IF(H43=('Components and Space Standards'!C13+'Components and Space Standards'!C14+'Components and Space Standards'!C15),T45,T45))))))","v":0},{"$f":"IF(H43=('Components and Space Standards'!C13+'Components and Space Standards'!C14+'Components and Space Standards'!C15),5,IF(H43=('Components and Space Standards'!C13+'Components and Space Standards'!C14),3,IF(H43='Components and Space Standards'!C14*2,4,IF(H43='Components and Space Standards'!C14*3,6,))))","v":0}]
[null,null,null,null,null,null,null,null,null,null,"Arena-style",{"$f":"\"1 \"&'Components and Space Standards'!D15","v":"1 Arena-style Two-Court Module(s)"},null,null,null,{"$f":"'Components and Space Standards'!C15","v":18392}]
[null,null,null,null,null,null,null,null,null,null,"Four Courts",{"$f":"\"2 \"&'Components and Space Standards'!D14","v":"2 Two-court/200-seat Module(s)"},null,null,null,{"$f":"2*'Components and Space Standards'!C14","v":35112},null,null,null,{"$f":"IF(H43=('Components and Space Standards'!C13+'Components and Space Standards'!C14+'Components and Space Standards'!C15),(200+200+1200),IF(H43=('Components and Space Standards'!C13+'Components and Space Standards'!C14),400,IF(H43='Components and Space Standards'!C14*2,400,IF(H43='Components and Space Standards'!C14*3,600,))))","v":0}]
[{"$f":"IF(OR($D$26<>\"Yes\",$D$26=0,$K$26<>\"Yes\"),,'Components and Space Standards'!A14)","v":0},null,null,null,{"$f":"IF(OR($D$26<>\"Yes\",$D$26=0,$K$26<>\"Yes\"),,IF($D$5=$K$5,$M48&\" \"&'Components and Space Standards'!$D14&\".\",IF($D$5=$K$6,$O48&\" \"&'Components and Space Standards'!$D14&\".\",IF($D$5=$K$7,$Q48&\" \"&'Components and Space Standards'!$D14&\".\",IF($D$5=$K$8,$S48&\" \"&'Components and Space Standards'!$D14&\".\",)))))","v":0},null,{"$f":"ROUND(H48*$K$33,2)","v":0},null,null,null,{"$f":"IF(OR($D$26<>\"Yes\",$D$26=0,$K$26<>\"Yes\"),,IF($D$5=$K$5,N48,IF($D$5=$K$6,P48,IF($D$5=$K$7,R48,IF($D$5=$K$8,T48,)))))","v":0},{"$f":"IF(OR($D$26<>\"Yes\",$D$26=0,$K$26<>\"Yes\"),,IF($D$5=$K$5,$M48&\" \"&'Components and Space Standards'!D14&\".\",IF($D$5=$K$6,$O48&\" \"&'Components and Space Standards'!D14&\".\",IF($D$5=$K$7,$Q48&\" \"&'Components and Space Standards'!D14&\".\",IF($D$5=$K$8,$S48&\" \"&'Components and Space Standards'!D14&\".\",)))))","v":0},{"$f":"IF($D$21=$M$9,Army!$F14,IF($D$21=$M$10,Army!$I14,IF($D$21='Interactive Worksheet'!$M$11,Army!$L14,IF($D$21='Interactive Worksheet'!$M$12,Army!$O14,IF($D$21='Interactive Worksheet'!$M$13,Army!$R14,)))))","v":{"$error":"#N/A"}},{"$f":"IF($D$21=$M$9,Army!$H14,IF($D$21=$M$10,Army!$K14,IF($D$21='Interactive Worksheet'!$M$11,Army!$N14,IF($D$21='Interactive Worksheet'!$M$12,Army!$Q14,IF($D$21='Interactive Worksheet'!$M$13,Army!$T14,)))))","v":{"$error":"#N/A"}},{"$f":"IF($D$21=$M$9,Navy!$F14,IF($D$21=$M$10,Navy!$I14,IF($D$21='Interactive Worksheet'!$M$11,Navy!$L14,IF($D$21='Interactive Worksheet'!$M$12,Navy!$O14,IF($D$21='Interactive Worksheet'!$M$13,Navy!$R14,IF($O$18>0,Navy!U14,))))))","v":{"$error":"#N/A"}},{"$f":"IF($D$21=$M$9,Navy!$H14,IF($D$21=$M$10,Navy!$K14,IF($D$21='Interactive Worksheet'!$M$11,Navy!$N14,IF($D$21='Interactive Worksheet'!$M$12,Navy!$Q14,IF($D$21='Interactive Worksheet'!$M$13,Navy!$T14,IF($O$18>0,Navy!W14,))))))","v":{"$error":"#N/A"}},{"$f":"IF($D$43<>0,\"See E45\",IF($D$21=$M$10,AF!F14,IF($D$21=$M$11,AF!I14,IF($D$21='Interactive Worksheet'!$M$12,AF!L14,))))","v":{"$error":"#N/A"}},{"$f":"IF($D$43<>0,\"See E45\",IF($D$21=$M$10,AF!H14,IF($D$21=$M$11,AF!K14,IF($D$21='Interactive Worksheet'!$M$12,AF!N14,))))","v":{"$error":"#N/A"}}]
[{"$f":"IF(OR($D$26<>\"Yes\",$D$26=0,$K$26<>\"Yes\"),,'Components and Space Standards'!A15)","v":0},null,null,null,{"$f":"IF(OR($D$26<>\"Yes\",$D$26=0,$K$26<>\"Yes\"),,IF($D$5=$K$5,$M49&\" \"&'Components and Space Standards'!$D15&\".\",IF($D$5=$K$6,$O49&\" \"&'Components and Space Standards'!$D15&\".\",IF($D$5=$K$7,$Q49&\" \"&'Components and Space Standards'!$D15&\".\",IF($D$5=$K$8,$S49&\" \"&'Components and Space Standards'!$D15&\".\",)))))","v":0},null,{"$f":"ROUND(H49*$K$33,2)","v":0},null,null,null,{"$f":"IF(OR($D$26<>\"Yes\",$D$26=0,$K$26<>\"Yes\"),,IF($D$5=$K$5,N49,IF($D$5=$K$6,P49,IF($D$5=$K$7,R49,IF($D$5=$K$8,T49,)))))","v":0},{"$f":"IF(OR($D$26<>\"Yes\",$D$26=0,$K$26<>\"Yes\"),,IF($D$5=$K$5,$M49&\" \"&'Components and Space Standards'!D15&\".\",IF($D$5=$K$6,$O49&\" \"&'Components and Space Standards'!D15&\".\",IF($D$5=$K$7,$Q49&\" \"&'Components and Space Standards'!D15&\".\",IF($D$5=$K$8,$S49&\" \"&'Components and Space Standards'!D15&\".\",)))))","v":0},{"$f":"IF($D$21=$M$9,Army!$F15,IF($D$21=$M$10,Army!$I15,IF($D$21='Interactive Worksheet'!$M$11,Army!$L15,IF($D$21='Interactive Worksheet'!$M$12,Army!$O15,IF($D$21='Interactive Worksheet'!$M$13,Army!$R15,)))))","v":{"$error":"#N/A"}},{"$f":"IF($D$21=$M$9,Army!$H15,IF($D$21=$M$10,Army!$K15,IF($D$21='Interactive Worksheet'!$M$11,Army!$N15,IF($D$21='Interactive Worksheet'!$M$12,Army!$Q15,IF($D$21='Interactive Worksheet'!$M$13,Army!$T15,)))))","v":{"$error":"#N/A"}},{"$f":"IF($D$21=$M$9,Navy!$F15,IF($D$21=$M$10,Navy!$I15,IF($D$21='Interactive Worksheet'!$M$11,Navy!$L15,IF($D$21='Interactive Worksheet'!$M$12,Navy!$O15,IF($D$21='Interactive Worksheet'!$M$13,Navy!$R15,IF($O$18>0,Navy!U15,))))))","v":{"$error":"#N/A"}},{"$f":"IF($D$21=$M$9,Navy!$H15,IF($D$21=$M$10,Navy!$K15,IF($D$21='Interactive Worksheet'!$M$11,Navy!$N15,IF($D$21='Interactive Worksheet'!$M$12,Navy!$Q15,IF($D$21='Interactive Worksheet'!$M$13,Navy!$T15,IF($O$18>0,Navy!W15,))))))","v":{"$error":"#N/A"}},{"$f":"IF($D$43<>0,\"See E45\",IF($D$21=$M$10,AF!F15,IF($D$21=$M$11,AF!I15,IF($D$21='Interactive Worksheet'!$M$12,AF!L15,))))","v":{"$error":"#N/A"}},{"$f":"IF($D$43<>0,\"See E45\",IF($D$21=$M$10,AF!H15,IF($D$21=$M$11,AF!K15,IF($D$21='Interactive Worksheet'!$M$12,AF!N15,))))","v":{"$error":"#N/A"}}]
[{"$f":"IF(OR($D$26<>\"Yes\",$D$26=0,$K$26<>\"Yes\"),,'Components and Space Standards'!A16)","v":0},null,{"$f":"IF(OR($D$26<>\"Yes\",$D$26=0,$K$26<>\"Yes\"),,\"To change default, enter new quantity:\")","v":0},0,{"$f":"IF(OR($D$26<>\"Yes\",$D$26=0,$K$26<>\"Yes\"),,IF(AND(D5=K5,N17>15000),\"For populations over 30K, use the Army Quantity Questionnaire.\",IF($D$5=$K$5,$M50&\" \"&'Components and Space Standards'!$D16&\". \"&K50+L50&\" total seats.\",IF($D$5=$K$6,$O50&\" \"&'Components and Space Standards'!$D16&\". \"&K50+L50&\" total seats.\",IF($D$5=$K$7,$Q50&\" \"&'Components and Space Standards'!$D16&\". \"&K50+L50&\" total seats.\",IF($D$5=$K$8,$S50&\" \"&'Components and Space Standards'!$D16&\". \"&K50+L50&\" total seats.\",))))))","v":0},null,{"$f":"ROUND(H50*$K$33,2)","v":0},{"$f":"IF(OR($D$26<>\"Yes\",$D$26=0,$K$26<>\"Yes\"),,IF($D$5=$K$5,N50,IF($D$5=$K$6,P50,IF($D$5=$K$7,R50,IF($D$5=$K$8,T50,)))))","v":0},null,{"$f":"IF(D50<>0,\"D\",)","v":0},{"$f":"IF(AND(D5=K5,N17>15000),0,IF(H43='Components and Space Standards'!C13,200,IF(H43='Components and Space Standards'!C14,200,IF(H43='Components and Space Standards'!C15,1200,IF(H43=('Components and Space Standards'!C13+'Components and Space Standards'!C15),(200+1200),IF(H43=('Components and Space Standards'!C14+'Components and Space Standards'!C15),(200+1200),IF(H43=('Components and Space Standards'!C13+'Components and Space Standards'!C14+'Components and Space Standards'!C15),T47,T47)))))))","v":0},{"$f":"ROUND((H50/912)*200,0)","v":0},{"$f":"IF($D50<>0,\"Error\",IF($D$21=$M$9,Army!$F16,IF($D$21=$M$10,Army!$I16,IF($D$21='Interactive Worksheet'!$M$11,Army!$L16,IF($D$21='Interactive Worksheet'!$M$12,Army!$O16,IF($D$21='Interactive Worksheet'!$M$13,IF($M$17=0,Army!$R16,($M$17*Army!U16)+Army!R16)))))))","v":{"$error":"#N/A"}},{"$f":"IF($D50<>0,\"Error\",IF($D$21=$M$9,Army!$H16,IF($D$21=$M$10,Army!$K16,IF($D$21='Interactive Worksheet'!$M$11,Army!$N16,IF($D$21='Interactive Worksheet'!$M$12,Army!$Q16,IF($D$21='Interactive Worksheet'!$M$13,IF($M$17=0,Army!$T16,($M$17*Army!W16)+Army!T16)))))))","v":{"$error":"#N/A"}},{"$f":"IF(D50<>0,D50,IF($D$21=$M$9,Navy!F16,IF($D$21=$M$10,Navy!I16,IF($D$21='Interactive Worksheet'!$M$11,Navy!L16,IF($D$21='Interactive Worksheet'!$M$12,Navy!O16,IF($D$21='Interactive Worksheet'!$M$13,Navy!R16,IF($O$18>0,Navy!U16,)))))))","v":{"$error":"#N/A"}},{"$f":"IF(D50<>0,D50*'Components and Space Standards'!C16,IF($D$21=$M$9,Navy!H16,IF($D$21=$M$10,Navy!K16,IF($D$21='Interactive Worksheet'!$M$11,Navy!N16,IF($D$21='Interactive Worksheet'!$M$12,Navy!Q16,IF($D$21='Interactive Worksheet'!$M$13,Navy!T16,IF($O$18>0,Navy!W16,)))))))","v":{"$error":"#N/A"}},{"$f":"IF(D50<>0,D50,IF($D$21=$M$10,AF!F16,IF($D$21=$M$11,AF!I16,IF($D$21='Interactive Worksheet'!$M$12,AF!L16,))))","v":{"$error":"#N/A"}},{"$f":"IF(D50<>0,D50*'Components and Space Standards'!C16,IF($D$21=$M$10,AF!H16,IF($D$21=$M$11,AF!K16,IF($D$21='Interactive Worksheet'!$M$12,AF!N16,))))","v":{"$error":"#N/A"}},{"$f":"IF($D50<>0,IF($D$50>3,3,$D$50),IF($D$21=$M$9,MC!F16,IF($D$21=$M$10,MC!I16,IF($D$21='Interactive Worksheet'!$M$11,MC!L16,IF($D$21='Interactive Worksheet'!$M$12,MC!O16,IF($D$21='Interactive Worksheet'!$M$13,MC!R16,))))))","v":{"$error":"#N/A"}},{"$f":"IF($D50<>0,(IF($D$50>3,3,$D$50)*'Components and Space Standards'!C16),IF($D$21=$M$9,MC!H16,IF($D$21=$M$10,MC!K16,IF($D$21='Interactive Worksheet'!$M$11,MC!N16,IF($D$21='Interactive Worksheet'!$M$12,MC!Q16,IF($D$21='Interactive Worksheet'!$M$13,MC!T16,))))))","v":{"$error":"#N/A"}}]
[{"$f":"IF(OR($D$26<>\"Yes\",$D$26=0,$K$26<>\"Yes\"),,'Components and Space Standards'!A17)","v":0},null,null,null,{"$f":"IF(OR($D$26<>\"Yes\",$D$26=0,$K$26<>\"Yes\"),,IF($D$5=$K$5,$M51&\" \"&'Components and Space Standards'!$D17&\".\",IF($D$5=$K$6,$O51&\" \"&'Components and Space Standards'!$D17&\".\",IF($D$5=$K$7,$Q51&\" \"&'Components and Space Standards'!$D17&\".\",IF($D$5=$K$8,ROUND(H51/700,0)&\" \"&'Components and Space Standards'!$D17&\".\",)))))","v":0},null,{"$f":"ROUND(H51*$K$33,2)","v":0},{"$f":"IF(OR($D$26<>\"Yes\",$D$26=0,$K$26<>\"Yes\"),,IF($D$5=$K$5,N51,IF($D$5=$K$6,P51,IF($D$5=$K$7,R51,IF($D$5=$K$8,0.08*H43,)))))","v":0},null,null,null,null,{"$f":"IF($D51<>0,$D51,IF($D$21=$M$9,Army!$F17,IF($D$21=$M$10,Army!$I17,IF($D$21='Interactive Worksheet'!$M$11,Army!$L17,IF($D$21='Interactive Worksheet'!$M$12,Army!$O17,IF($D$21='Interactive Worksheet'!$M$13,IF($M$17=0,Army!$R17,($M$17*Army!U17)+Army!R17)))))))","v":{"$error":"#N/A"}},{"$f":"IF($D51<>0,$D51*'Components and Space Standards'!$C17,IF($D$21=$M$9,Army!$H17,IF($D$21=$M$10,Army!$K17,IF($D$21='Interactive Worksheet'!$M$11,Army!$N17,IF($D$21='Interactive Worksheet'!$M$12,Army!$Q17,IF($D$21='Interactive Worksheet'!$M$13,IF($M$17=0,Army!$T17,($M$17*Army!W17)+Army!T17)))))))","v":{"$error":"#N/A"}},{"$f":"IF(D51<>0,D51,IF($D$21=$M$9,Navy!F17,IF($D$21=$M$10,Navy!I17,IF($D$21='Interactive Worksheet'!$M$11,Navy!L17,IF($D$21='Interactive Worksheet'!$M$12,Navy!O17,IF($D$21='Interactive Worksheet'!$M$13,Navy!R17,IF($O$18>0,Navy!U17,)))))))","v":{"$error":"#N/A"}},{"$f":"IF(D51<>0,D51*'Components and Space Standards'!C17,IF($D$21=$M$9,Navy!H17,IF($D$21=$M$10,Navy!K17,IF($D$21='Interactive Worksheet'!$M$11,Navy!N17,IF($D$21='Interactive Worksheet'!$M$12,Navy!Q17,IF($D$21='Interactive Worksheet'!$M$13,Navy!T17,IF($O$18>0,Navy!W17,)))))))","v":{"$error":"#N/A"}},{"$f":"IF(D51<>0,D51,IF($D$21=$M$10,AF!F17,IF($D$21=$M$11,AF!I17,IF($D$21='Interactive Worksheet'!$M$12,AF!L17,))))","v":{"$error":"#N/A"}},{"$f":"IF(D51<>0,D51*'Components and Space Standards'!C17,IF($D$21=$M$10,AF!H17,IF($D$21=$M$11,AF!K17,IF($D$21='Interactive Worksheet'!$M$12,AF!N17,))))","v":{"$error":"#N/A"}},{"$f":"IF($D51<>0,$D51,IF($D$21=$M$9,MC!F17,IF($D$21=$M$10,MC!I17,IF($D$21='Interactive Worksheet'!$M$11,MC!L17,IF($D$21='Interactive Worksheet'!$M$12,MC!O17,IF($D$21='Interactive Worksheet'!$M$13,MC!R17,))))))","v":{"$error":"#N/A"}},{"$f":"IF($D51<>0,$D51*'Components and Space Standards'!C17,IF($D$21=$M$9,MC!H17,IF($D$21=$M$10,MC!K17,IF($D$21='Interactive Worksheet'!$M$11,MC!N17,IF($D$21='Interactive Worksheet'!$M$12,MC!Q17,IF($D$21='Interactive Worksheet'!$M$13,MC!T17,))))))","v":{"$error":"#N/A"}}]
[{"$f":"IF(OR($D$26<>\"Yes\",$D$26=0,$K$26<>\"Yes\"),,'Components and Space Standards'!A18)","v":0},null,null,null,{"$f":"IF(OR($D$26<>\"Yes\",$D$26=0,$K$26<>\"Yes\"),,IF($D$5=$K$5,$M52&\" \"&'Components and Space Standards'!$D18&\".\",IF($D$5=$K$6,$O52&\" \"&'Components and Space Standards'!$D18&\".\",IF($D$5=$K$7,$Q52&\" \"&'Components and Space Standards'!$D18&\".\",IF($D$5=$K$8,$S52&\" \"&'Components and Space Standards'!$D18&\".\",)))))","v":0},null,{"$f":"ROUND(H52*$K$33,2)","v":0},{"$f":"IF(OR($D$26<>\"Yes\",$D$26=0,$K$26<>\"Yes\"),,IF($D$5=$K$5,N52,IF($D$5=$K$6,P52,IF($D$5=$K$7,R52,IF($D$5=$K$8,T52,)))))","v":0},null,null,null,null,{"$f":"IF($D52<>0,$D52,IF($D$21=$M$9,Army!$F18,IF($D$21=$M$10,Army!$I18,IF($D$21='Interactive Worksheet'!$M$11,Army!$L18,IF($D$21='Interactive Worksheet'!$M$12,Army!$O18,IF($D$21='Interactive Worksheet'!$M$13,IF($M$17=0,Army!$R18,($M$17*Army!U18)+Army!R18)))))))","v":{"$error":"#N/A"}},{"$f":"IF($D52<>0,$D52*'Components and Space Standards'!$C18,IF($D$21=$M$9,Army!$H18,IF($D$21=$M$10,Army!$K18,IF($D$21='Interactive Worksheet'!$M$11,Army!$N18,IF($D$21='Interactive Worksheet'!$M$12,Army!$Q18,IF($D$21='Interactive Worksheet'!$M$13,IF($M$17=0,Army!$T18,($M$17*Army!W18)+Army!T18)))))))","v":{"$error":"#N/A"}},{"$f":"IF(D52<>0,D52,IF($D$21=$M$9,Navy!F18,IF($D$21=$M$10,Navy!I18,IF($D$21='Interactive Worksheet'!$M$11,Navy!L18,IF($D$21='Interactive Worksheet'!$M$12,Navy!O18,IF($D$21='Interactive Worksheet'!$M$13,Navy!R18,IF($O$18>0,Navy!U18,)))))))","v":{"$error":"#N/A"}},{"$f":"IF(D52<>0,D52*'Components and Space Standards'!C18,IF($D$21=$M$9,Navy!H18,IF($D$21=$M$10,Navy!K18,IF($D$21='Interactive Worksheet'!$M$11,Navy!N18,IF($D$21='Interactive Worksheet'!$M$12,Navy!Q18,IF($D$21='Interactive Worksheet'!$M$13,Navy!T18,IF($O$18>0,Navy!W18,)))))))","v":{"$error":"#N/A"}},{"$f":"IF(D52<>0,D52,IF($D$21=$M$10,AF!F18,IF($D$21=$M$11,AF!I18,IF($D$21='Interactive Worksheet'!$M$12,AF!L18,))))","v":{"$error":"#N/A"}},{"$f":"IF(D52<>0,D52*'Components and Space Standards'!C18,IF($D$21=$M$10,AF!H18,IF($D$21=$M$11,AF!K18,IF($D$21='Interactive Worksheet'!$M$12,AF!N18,))))","v":{"$error":"#N/A"}},{"$f":"IF($D52<>0,$D52,IF($D$21=$M$9,MC!F18,IF($D$21=$M$10,MC!I18,IF($D$21='Interactive Worksheet'!$M$11,MC!L18,IF($D$21='Interactive Worksheet'!$M$12,MC!O18,IF($D$21='Interactive Worksheet'!$M$13,MC!R18,))))))","v":{"$error":"#N/A"}},{"$f":"IF($D52<>0,$D52*'Components and Space Standards'!C18,IF($D$21=$M$9,MC!H18,IF($D$21=$M$10,MC!K18,IF($D$21='Interactive Worksheet'!$M$11,MC!N18,IF($D$21='Interactive Worksheet'!$M$12,MC!Q18,IF($D$21='Interactive Worksheet'!$M$13,MC!T18,))))))","v":{"$error":"#N/A"}}]
[{"$f":"IF(OR($D$26<>\"Yes\",$D$26=0,$K$26<>\"Yes\"),,'Components and Space Standards'!A19)","v":0},null,null,null,null,null,{"$f":"ROUND(H53*$K$33,2)","v":0},{"$f":"IF(OR($D$26<>\"Yes\",$D$26=0,$K$26<>\"Yes\"),,IF($D$5=$K$5,N53,IF($D$5=$K$6,P53,IF($D$5=$K$7,R53,IF($D$5=$K$8,T53,)))))","v":0},null,null,null,null,null,null,{"$f":"IF(D53<>0,D53,IF($D$21=$M$9,Navy!F19,IF($D$21=$M$10,Navy!I19,IF($D$21='Interactive Worksheet'!$M$11,Navy!L19,IF($D$21='Interactive Worksheet'!$M$12,Navy!O19,IF($D$21='Interactive Worksheet'!$M$13,Navy!R19,))))))","v":{"$error":"#N/A"}},{"$f":"IF(D53<>0,D53*'Components and Space Standards'!C19,IF($D$21=$M$9,Navy!H19,IF($D$21=$M$10,Navy!K19,IF($D$21='Interactive Worksheet'!$M$11,Navy!N19,IF($D$21='Interactive Worksheet'!$M$12,Navy!Q19,IF($D$21='Interactive Worksheet'!$M$13,Navy!T19,))))))","v":{"$error":"#N/A"}},{"$f":"IF(D53<>0,D53,IF($D$21=$M$10,AF!F19,IF($D$21=$M$11,AF!I19,IF($D$21='Interactive Worksheet'!$M$12,AF!L19,))))","v":{"$error":"#N/A"}},{"$f":"IF(D53<>0,D53*'Components and Space Standards'!C19,IF($D$21=$M$10,AF!H19,IF($D$21=$M$11,AF!K19,IF($D$21='Interactive Worksheet'!$M$12,AF!N19,))))","v":{"$error":"#N/A"}},{"$f":"IF($D53<>0,$D53,IF($D$21=$M$9,MC!F19,IF($D$21=$M$10,MC!I19,IF($D$21='Interactive Worksheet'!$M$11,MC!L19,IF($D$21='Interactive Worksheet'!$M$12,MC!O19,IF($D$21='Interactive Worksheet'!$M$13,MC!R19,))))))","v":{"$error":"#N/A"}},{"$f":"IF($D53<>0,$D53*'Components and Space Standards'!C19,IF($D$21=$M$9,MC!H19,IF($D$21=$M$10,MC!K19,IF($D$21='Interactive Worksheet'!$M$11,MC!N19,IF($D$21='Interactive Worksheet'!$M$12,MC!Q19,IF($D$21='Interactive Worksheet'!$M$13,MC!T19,))))))","v":{"$error":"#N/A"}}]
[{"$f":"IF(OR($D$26<>\"Yes\",$D$26=0,$K$26<>\"Yes\"),,'Components and Space Standards'!A20)","v":0},null,{"$f":"IF(OR($D$26<>\"Yes\",$D$26=0,$K$26<>\"Yes\"),,\"To change default, enter new quantity of ppl:\")","v":0},null,{"$f":"IF(OR($D$26<>\"Yes\",$D$26=0,$K$26<>\"Yes\"),,IF($D$5=$K$5,$M54&\" \"&'Components and Space Standards'!$D20&\".\",IF($D$5=$K$6,$O54&\" \"&'Components and Space Standards'!$D20&\".\",IF($D$5=$K$7,$Q54&\" \"&'Components and Space Standards'!$D20&\".\",IF($D$5=$K$8,$S54&\" \"&'Components and Space Standards'!$D20&\".\",)))))","v":0},null,0,{"$f":"IF($D$54<>0,$D$54*50,IF(OR($D$26<>\"Yes\",$D$26=0,$K$26<>\"Yes\"),,IF($D$5=$K$5,N54,IF($D$5=$K$6,P54,IF($D$5=$K$7,R54,IF($D$5=$K$8,T54,))))))","v":0},null,{"$f":"IF(D54<>0,\"D\",)","v":0},null,null,{"$f":"IF($D54<>0,$D54,IF($D$21=$M$9,Army!$F20,IF($D$21=$M$10,Army!$I20,IF($D$21='Interactive Worksheet'!$M$11,Army!$L20,IF($D$21='Interactive Worksheet'!$M$12,Army!$O20,IF($D$21='Interactive Worksheet'!$M$13,IF($M$17=0,Army!$R20,($M$17*Army!U20)+Army!R20)))))))","v":{"$error":"#N/A"}},{"$f":"IF($D54<>0,$D54*'Components and Space Standards'!C20,IF($D$21=$M$9,Army!$H20,IF($D$21=$M$10,Army!$K20,IF($D$21=$M$11,Army!$N20,IF($D$21=$M$12,Army!$Q20,IF($D$21=$M$13,IF($M$17=0,Army!$T20,($M$17*Army!W20)+Army!T20)))))))","v":{"$error":"#N/A"}},{"$f":"IF($D54<>0,$D54,IF($D$21=$M$9,Navy!$F20,IF($D$21=$M$10,Navy!$I20,IF($D$21=$M$11,Navy!$L20,IF($D$21=$M$12,Navy!$O20,IF($D$21=$M$13,Navy!$R20,IF($O$18>0,Navy!U20,)))))))","v":{"$error":"#N/A"}},{"$f":"IF($D54<>0,$D54*'Components and Space Standards'!C20,IF($D$21=$M$9,Navy!$H20,IF($D$21=$M$10,Navy!$K20,IF($D$21=$M$11,Navy!$N20,IF($D$21=$M$12,Navy!$Q20,IF($D$21=$M$13,Navy!$T20,IF($O$18>0,Navy!W20,)))))))","v":{"$error":"#N/A"}},{"$f":"IF(D54<>0,D54,IF($D$21=$M$10,AF!F20,IF($D$21=$M$11,AF!I20,IF($D$21=$M$12,AF!L20,))))","v":{"$error":"#N/A"}},{"$f":"IF(D54<>0,$D54*'Components and Space Standards'!C20,IF($D$21=$M$10,AF!H20,IF($D$21=$M$11,AF!K20,IF($D$21=$M$12,AF!N20,))))","v":{"$error":"#N/A"}},{"$f":"IF($D54<>0,$D54,IF($D$21=$M$9,MC!F20,IF($D$21=$M$10,MC!I20,IF($D$21=$M$11,MC!L20,IF($D$21=$M$12,MC!O20,IF($D$21=$M$13,MC!R20,))))))","v":{"$error":"#N/A"}},{"$f":"IF($D54<>0,$D54*'Components and Space Standards'!C20,IF($D$21=$M$9,MC!H20,IF($D$21=$M$10,MC!K20,IF($D$21=$M$11,MC!N20,IF($D$21=$M$12,MC!Q20,IF($D$21=$M$13,MC!T20,))))))","v":{"$error":"#N/A"}},{"$f":"(H54/50)*1","v":0}]
[{"$f":"IF(OR($D$26<>\"Yes\",$D$26=0,$K$26<>\"Yes\"),,'Components and Space Standards'!A21)","v":0},null,null,null,{"$f":"IF(OR($D$26<>\"Yes\",$D$26=0,$K$26<>\"Yes\"),,IF($D$5=$K$5,$M55&\" \"&'Components and Space Standards'!$D21&\".\",IF($D$5=$K$6,$O55&\" \"&'Components and Space Standards'!$D21&\".\",IF($D$5=$K$7,$Q55&\" \"&'Components and Space Standards'!$D21&\".\",IF($D$5=$K$8,$S55&\" \"&'Components and Space Standards'!$D21&\".\",)))))","v":0},null,0,0,null,null,null,null,null,{"$f":"IF($H$54=0,0,N54*0.1)","v":0},null,{"$f":"IF($H$54=0,0,P54*0.1)","v":0},null,{"$f":"IF($H$54=0,0,R54*0.1)","v":0},null,{"$f":"IF($H$54=0,0,T54*0.1)","v":0}]
[{"$f":"IF(OR($D$26<>\"Yes\",$D$26=0,$K$26<>\"Yes\"),,'Components and Space Standards'!A22)","v":0},null,null,null,null,null,null,null,null,null,null,null,null,{"$f":"SUM(N57:N60)","v":{"$error":"#N/A"}},null,{"$f":"SUM(P57:P60)","v":{"$error":"#N/A"}},null,{"$f":"SUM(R57:R60)","v":{"$error":"#N/A"}},null,{"$f":"SUM(T57:T60)","v":{"$error":"#N/A"}},null,"(Fitness spaces summed minus Fitness Assessment.)"]
[{"$f":"IF(OR($D$26<>\"Yes\",$D$26=0,$K$26<>\"Yes\"),,'Components and Space Standards'!A23)","v":0},null,null,null,{"$f":"IF(OR($D$26<>\"Yes\",$D$26=0,$K$26<>\"Yes\"),,IF($D$5=$K$5,$M57&\" \"&'Components and Space Standards'!$D23&\".\",IF($D$5=$K$6,$O57&\" \"&'Components and Space Standards'!$D23&\".\",IF($D$5=$K$7,$Q57&\" \"&'Components and Space Standards'!$D23&\".\",IF($D$5=$K$8,$S57&\" \"&'Components and Space Standards'!$D23&\".\",)))))","v":0},null,0,0,null,null,null,null,{"$f":"IF($D57<>0,$D57,IF($D$21=$M$9,Army!$F23,IF($D$21=$M$10,Army!$I23,IF($D$21='Interactive Worksheet'!$M$11,Army!$L23,IF($D$21='Interactive Worksheet'!$M$12,Army!$O23,IF($D$21='Interactive Worksheet'!$M$13,IF($M$17=0,Army!$R23,($M$17*Army!U23)+Army!R23)))))))","v":{"$error":"#N/A"}},{"$f":"IF($D57<>0,$D57*'Components and Space Standards'!$C23,IF($D$21=$M$9,Army!$H23,IF($D$21=$M$10,Army!$K23,IF($D$21='Interactive Worksheet'!$M$11,Army!$N23,IF($D$21='Interactive Worksheet'!$M$12,Army!$Q23,IF($D$21='Interactive Worksheet'!$M$13,IF($M$17=0,Army!$T23,($M$17*Army!W23)+Army!T23)))))))","v":{"$error":"#N/A"}},{"$f":"IF(D57<>0,D57,IF($D$21=$M$9,Navy!F23,IF($D$21=$M$10,Navy!I23,IF($D$21='Interactive Worksheet'!$M$11,Navy!L23,IF($D$21='Interactive Worksheet'!$M$12,Navy!O23,IF($D$21='Interactive Worksheet'!$M$13,Navy!R23,IF($O$18>0,Navy!U23,)))))))","v":{"$error":"#N/A"}},{"$f":"IF(D57<>0,D57*'Components and Space Standards'!C23,IF($D$21=$M$9,Navy!H23,IF($D$21=$M$10,Navy!K23,IF($D$21='Interactive Worksheet'!$M$11,Navy!N23,IF($D$21='Interactive Worksheet'!$M$12,Navy!Q23,IF($D$21='Interactive Worksheet'!$M$13,Navy!T23,IF($O$18>0,Navy!W23,)))))))","v":{"$error":"#N/A"}},{"$f":"IF(D57<>0,D57,IF($D$21=$M$10,AF!F23,IF($D$21=$M$11,AF!I23,IF($D$21='Interactive Worksheet'!$M$12,AF!L23,))))","v":{"$error":"#N/A"}},{"$f":"IF(D57<>0,D57*'Components and Space Standards'!C23,IF($D$21=$M$10,AF!H23,IF($D$21=$M$11,AF!K23,IF($D$21='Interactive Worksheet'!$M$12,AF!N23,))))","v":{"$error":"#N/A"}},{"$f":"IF($D57<>0,$D57,IF($D$21=$M$9,MC!F23,IF($D$21=$M$10,MC!I23,IF($D$21='Interactive Worksheet'!$M$11,MC!L23,IF($D$21='Interactive Worksheet'!$M$12,MC!O23,IF($D$21='Interactive Worksheet'!$M$13,MC!R23,))))))","v":{"$error":"#N/A"}},{"$f":"IF($D57<>0,$D57*'Components and Space Standards'!C23,IF($D$21=$M$9,MC!H23,IF($D$21=$M$10,MC!K23,IF($D$21='Interactive Worksheet'!$M$11,MC!N23,IF($D$21='Interactive Worksheet'!$M$12,MC!Q23,IF($D$21='Interactive Worksheet'!$M$13,MC!T23,))))))","v":{"$error":"#N/A"}}]
[{"$f":"IF(OR($D$26<>\"Yes\",$D$26=0,$K$26<>\"Yes\"),,'Components and Space Standards'!A24)","v":0},null,null,null,{"$f":"IF(OR($D$26<>\"Yes\",$D$26=0,$K$26<>\"Yes\"),,IF($D$5=$K$5,$M58&\" \"&'Components and Space Standards'!$D24&\".\",IF($D$5=$K$6,$O58&\" \"&'Components and Space Standards'!$D24&\".\",IF($D$5=$K$7,$Q58&\" \"&'Components and Space Standards'!$D24&\".\",IF(AND($D$5=$K$8,L9=0,L10=0),K58,$S58&\" \"&'Components and Space Standards'!$D24&\".\")))))","v":0},null,0,0,null,null,"For Medium and larger facilities, this number includes area for cardio, selectorized, and free weights.",null,{"$f":"IF($D58<>0,$D58,IF($D$21=$M$9,Army!$F24,IF($D$21=$M$10,Army!$I24,IF($D$21='Interactive Worksheet'!$M$11,Army!$L24,IF($D$21='Interactive Worksheet'!$M$12,Army!$O24,IF($D$21='Interactive Worksheet'!$M$13,IF($M$17=0,Army!$R24,($M$17*Army!U24)+Army!R24)))))))","v":{"$error":"#N/A"}},{"$f":"IF($D58<>0,$D58*'Components and Space Standards'!$C24,IF($D$21=$M$9,Army!$H24,IF($D$21=$M$10,Army!$K24,IF($D$21='Interactive Worksheet'!$M$11,Army!$N24,IF($D$21='Interactive Worksheet'!$M$12,Army!$Q24,IF($D$21='Interactive Worksheet'!$M$13,IF($M$17=0,Army!$T24,($M$17*Army!W24)+Army!T24)))))))","v":{"$error":"#N/A"}},{"$f":"IF(D58<>0,D58,IF($D$21=$M$9,Navy!F24,IF($D$21=$M$10,Navy!I24,IF($D$21='Interactive Worksheet'!$M$11,Navy!L24,IF($D$21='Interactive Worksheet'!$M$12,Navy!O24,IF($D$21='Interactive Worksheet'!$M$13,Navy!R24,IF($O$18>0,Navy!U24,)))))))","v":{"$error":"#N/A"}},{"$f":"IF(D58<>0,D58*'Components and Space Standards'!C24,IF($D$21=$M$9,Navy!H24,IF($D$21=$M$10,Navy!K24,IF($D$21='Interactive Worksheet'!$M$11,Navy!N24,IF($D$21='Interactive Worksheet'!$M$12,Navy!Q24,IF($D$21='Interactive Worksheet'!$M$13,Navy!T24,IF($O$18>0,Navy!W24,)))))))","v":{"$error":"#N/A"}},{"$f":"IF(D58<>0,D58,IF($D$21=$M$10,AF!F24,IF($D$21=$M$11,AF!I24,IF($D$21='Interactive Worksheet'!$M$12,AF!L24,))))","v":{"$error":"#N/A"}},{"$f":"IF(D58<>0,D58*'Components and Space Standards'!C24,IF($D$21=$M$10,AF!H24,IF($D$21=$M$11,AF!K24,IF($D$21='Interactive Worksheet'!$M$12,AF!N24,))))","v":{"$error":"#N/A"}},{"$f":"IF($D58<>0,$D58,IF($D$21=$M$9,MC!F24,IF($D$21=$M$10,MC!I24,IF($D$21='Interactive Worksheet'!$M$11,MC!L24,IF($D$21='Interactive Worksheet'!$M$12,MC!O24,IF($D$21='Interactive Worksheet'!$M$13,MC!R24,))))))","v":{"$error":"#N/A"}},{"$f":"IF($D58<>0,$D58*'Components and Space Standards'!C24,IF($D$21=$M$9,MC!H24,IF($D$21=$M$10,MC!K24,(0.035*G23*38.5))))","v":{"$error":"#N/A"}},{"$f":"IF(AND(D5=K8,L9=0,L10=0),(0.035*G23),(H58/50)*1)","v":0}]
[{"$f":"IF(OR($D$26<>\"Yes\",$D$26=0,$K$26<>\"Yes\"),,'Components and Space Standards'!A25)","v":0},null,null,null,{"$f":"IF(OR($D$26<>\"Yes\",$D$26=0,$K$26<>\"Yes\"),,IF($D$5=$K$5,$M59&\" \"&'Components and Space Standards'!$D25&\".\",IF($D$5=$K$6,$O59&\" \"&'Components and Space Standards'!$D25&\".\",IF($D$5=$K$7,$Q59&\" \"&'Components and Space Standards'!$D25&\".\",IF(AND($D$5=$K$8,$G$16>3000),\"See above.\",$S59&\" \"&'Components and Space Standards'!$D25&\".\")))))","v":0},null,0,0,null,null,null,null,{"$f":"IF($D59<>0,$D59,IF($D$21=$M$9,Army!$F25,IF($D$21=$M$10,Army!$I25,IF($D$21='Interactive Worksheet'!$M$11,Army!$L25,IF($D$21='Interactive Worksheet'!$M$12,Army!$O25,IF($D$21='Interactive Worksheet'!$M$13,IF($M$17=0,Army!$R25,($M$17*Army!U25)+Army!R25)))))))","v":{"$error":"#N/A"}},{"$f":"IF($D59<>0,$D59*'Components and Space Standards'!$C25,IF($D$21=$M$9,Army!$H25,IF($D$21=$M$10,Army!$K25,IF($D$21='Interactive Worksheet'!$M$11,Army!$N25,IF($D$21='Interactive Worksheet'!$M$12,Army!$Q25,IF($D$21='Interactive Worksheet'!$M$13,IF($M$17=0,Army!$T25,($M$17*Army!W25)+Army!T25)))))))","v":{"$error":"#N/A"}},{"$f":"IF(D59<>0,D59,IF($D$21=$M$9,Navy!F25,IF($D$21=$M$10,Navy!I25,IF($D$21='Interactive Worksheet'!$M$11,Navy!L25,IF($D$21='Interactive Worksheet'!$M$12,Navy!O25,IF($D$21='Interactive Worksheet'!$M$13,Navy!R25,IF($O$18>0,Navy!U25,)))))))","v":{"$error":"#N/A"}},{"$f":"IF(D59<>0,D59*'Components and Space Standards'!C25,IF($D$21=$M$9,Navy!H25,IF($D$21=$M$10,Navy!K25,IF($D$21='Interactive Worksheet'!$M$11,Navy!N25,IF($D$21='Interactive Worksheet'!$M$12,Navy!Q25,IF($D$21='Interactive Worksheet'!$M$13,Navy!T25,IF($O$18>0,Navy!W25,)))))))","v":{"$error":"#N/A"}},{"$f":"IF(D59<>0,D59,IF($D$21=$M$10,AF!F25,IF($D$21=$M$11,AF!I25,IF($D$21='Interactive Worksheet'!$M$12,AF!L25,))))","v":{"$error":"#N/A"}},{"$f":"IF(D59<>0,D59*'Components and Space Standards'!C25,IF($D$21=$M$10,AF!H25,IF($D$21=$M$11,AF!K25,IF($D$21='Interactive Worksheet'!$M$12,AF!N25,))))","v":{"$error":"#N/A"}},{"$f":"IF($D59<>0,$D59,IF($D$21=$M$9,MC!F25,IF($D$21=$M$10,MC!I25,IF($D$21='Interactive Worksheet'!$M$11,MC!L25,IF($D$21='Interactive Worksheet'!$M$12,MC!O25,IF($D$21='Interactive Worksheet'!$M$13,MC!R25,))))))","v":{"$error":"#N/A"}},{"$f":"IF($D59<>0,$D59*'Components and Space Standards'!C25,IF($D$21=$M$9,MC!H25,IF($D$21=$M$10,MC!K25,IF($D$21='Interactive Worksheet'!$M$11,MC!N25,IF($D$21='Interactive Worksheet'!$M$12,MC!Q25,IF($D$21='Interactive Worksheet'!$M$13,MC!T25,))))))","v":{"$error":"#N/A"}},{"$f":"(H59/50)*2","v":0}]
[{"$f":"IF(OR($D$26<>\"Yes\",$D$26=0,$K$26<>\"Yes\"),,'Components and Space Standards'!A26)","v":0},null,null,null,{"$f":"IF(OR($D$26<>\"Yes\",$D$26=0,$K$26<>\"Yes\"),,IF($D$5=$K$5,$M60&\" \"&'Components and Space Standards'!$D26&\".\",IF($D$5=$K$6,$O60&\" \"&'Components and Space Standards'!$D26&\".\",IF($D$5=$K$7,$Q60&\" \"&'Components and Space Standards'!$D26&\".\",IF(AND($D$5=$K$8,$G$16>3000),\"See above.\",$S60&\" \"&'Components and Space Standards'!$D26&\".\")))))","v":0},null,0,0,null,null,null,null,{"$f":"IF($D60<>0,$D60,IF($D$21=$M$9,Army!$F26,IF($D$21=$M$10,Army!$I26,IF($D$21='Interactive Worksheet'!$M$11,Army!$L26,IF($D$21='Interactive Worksheet'!$M$12,Army!$O26,IF($D$21='Interactive Worksheet'!$M$13,IF($M$17=0,Army!$R26,($M$17*Army!U26)+Army!R26)))))))","v":{"$error":"#N/A"}},{"$f":"IF($D60<>0,$D60*'Components and Space Standards'!$C26,IF($D$21=$M$9,Army!$H26,IF($D$21=$M$10,Army!$K26,IF($D$21='Interactive Worksheet'!$M$11,Army!$N26,IF($D$21='Interactive Worksheet'!$M$12,Army!$Q26,IF($D$21='Interactive Worksheet'!$M$13,IF($M$17=0,Army!$T26,($M$17*Army!W26)+Army!T26)))))))","v":{"$error":"#N/A"}},{"$f":"IF(D60<>0,D60,IF($D$21=$M$9,Navy!F26,IF($D$21=$M$10,Navy!I26,IF($D$21='Interactive Worksheet'!$M$11,Navy!L26,IF($D$21='Interactive Worksheet'!$M$12,Navy!O26,IF($D$21='Interactive Worksheet'!$M$13,Navy!R26,IF($O$18>0,Navy!U26,)))))))","v":{"$error":"#N/A"}},{"$f":"IF(D60<>0,D60*'Components and Space Standards'!C26,IF($D$21=$M$9,Navy!H26,IF($D$21=$M$10,Navy!K26,IF($D$21='Interactive Worksheet'!$M$11,Navy!N26,IF($D$21='Interactive Worksheet'!$M$12,Navy!Q26,IF($D$21='Interactive Worksheet'!$M$13,Navy!T26,IF($O$18>0,Navy!W26,)))))))","v":{"$error":"#N/A"}},{"$f":"IF(D60<>0,D60,IF($D$21=$M$10,AF!F26,IF($D$21=$M$11,AF!I26,IF($D$21='Interactive Worksheet'!$M$12,AF!L26,))))","v":{"$error":"#N/A"}},{"$f":"IF(D60<>0,D60*'Components and Space Standards'!C26,IF($D$21=$M$10,AF!H26,IF($D$21=$M$11,AF!K26,IF($D$21='Interactive Worksheet'!$M$12,AF!N26,))))","v":{"$error":"#N/A"}},{"$f":"IF($D60<>0,$D60,IF($D$21=$M$9,MC!F26,IF($D$21=$M$10,MC!I26,IF($D$21='Interactive Worksheet'!$M$11,MC!L26,IF($D$21='Interactive Worksheet'!$M$12,MC!O26,IF($D$21='Interactive Worksheet'!$M$13,MC!R26,))))))","v":{"$error":"#N/A"}},{"$f":"IF($D60<>0,$D60*'Components and Space Standards'!C26,IF($D$21=$M$9,MC!H26,IF($D$21=$M$10,MC!K26,IF($D$21='Interactive Worksheet'!$M$11,MC!N26,IF($D$21='Interactive Worksheet'!$M$12,MC!Q26,IF($D$21='Interactive Worksheet'!$M$13,MC!T26,))))))","v":{"$error":"#N/A"}},{"$f":"(H60/65)*2","v":0}]
[{"$f":"IF(OR($D$26<>\"Yes\",$D$26=0,$K$26<>\"Yes\"),,'Components and Space Standards'!A27)","v":0},null,null,null,{"$f":"IF(OR($D$26<>\"Yes\",$D$26=0,$K$26<>\"Yes\"),,IF($D$5=$K$5,$M61&\" \"&'Components and Space Standards'!$D27&\".\",IF($D$5=$K$6,$O61&\" \"&'Components and Space Standards'!$D27&\".\",IF($D$5=$K$7,$Q61&\" \"&'Components and Space Standards'!$D27&\".\",IF($D$5=$K$8,$S61&\" \"&'Components and Space Standards'!$D27&\".\",)))))","v":0},null,{"$f":"ROUND(H61*$K$33,2)","v":0},{"$f":"IF(OR($D$26<>\"Yes\",$D$26=0,$K$26<>\"Yes\"),,IF($D$5=$K$5,N61,IF($D$5=$K$6,P61,IF($D$5=$K$7,R61,IF($D$5=$K$8,T61,)))))","v":0},null,null,null,null,{"$f":"IF($D61<>0,$D61,IF($D$21=$M$9,Army!$F27,IF($D$21=$M$10,Army!$I27,IF($D$21='Interactive Worksheet'!$M$11,Army!$L27,IF($D$21='Interactive Worksheet'!$M$12,Army!$O27,IF($D$21='Interactive Worksheet'!$M$13,IF($M$17=0,Army!$R27,($M$17*Army!U27)+Army!R27)))))))","v":{"$error":"#N/A"}},{"$f":"IF($D61<>0,$D61*'Components and Space Standards'!$C27,IF($D$21=$M$9,Army!$H27,IF($D$21=$M$10,Army!$K27,IF($D$21='Interactive Worksheet'!$M$11,Army!$N27,IF($D$21='Interactive Worksheet'!$M$12,Army!$Q27,IF($D$21='Interactive Worksheet'!$M$13,IF($M$17=0,Army!$T27,($M$17*Army!W27)+Army!T27)))))))","v":{"$error":"#N/A"}},{"$f":"IF(D61<>0,D61,IF($D$21=$M$9,Navy!F27,IF($D$21=$M$10,Navy!I27,IF($D$21='Interactive Worksheet'!$M$11,Navy!L27,IF($D$21='Interactive Worksheet'!$M$12,Navy!O27,IF($D$21='Interactive Worksheet'!$M$13,Navy!R27,IF($O$18>0,Navy!U27,)))))))","v":{"$error":"#N/A"}},{"$f":"IF(D61<>0,D61*'Components and Space Standards'!C27,IF($D$21=$M$9,Navy!H27,IF($D$21=$M$10,Navy!K27,IF($D$21='Interactive Worksheet'!$M$11,Navy!N27,IF($D$21='Interactive Worksheet'!$M$12,Navy!Q27,IF($D$21='Interactive Worksheet'!$M$13,Navy!T27,IF($O$18>0,Navy!W27,)))))))","v":{"$error":"#N/A"}},{"$f":"IF(D61<>0,D61,IF($D$21=$M$10,AF!F27,IF($D$21=$M$11,AF!I27,IF($D$21='Interactive Worksheet'!$M$12,AF!L27,))))","v":{"$error":"#N/A"}},{"$f":"IF(D61<>0,D61*'Components and Space Standards'!C27,IF($D$21=$M$10,AF!H27,IF($D$21=$M$11,AF!K27,IF($D$21='Interactive Worksheet'!$M$12,AF!N27,))))","v":{"$error":"#N/A"}},{"$f":"IF($D61<>0,$D61,IF($D$21=$M$9,MC!F27,IF($D$21=$M$10,MC!I27,IF($D$21='Interactive Worksheet'!$M$11,MC!L27,IF($D$21='Interactive Worksheet'!$M$12,MC!O27,IF($D$21='Interactive Worksheet'!$M$13,MC!R27,))))))","v":{"$error":"#N/A"}},{"$f":"IF($D61<>0,$D61*'Components and Space Standards'!C27,IF($D$21=$M$9,MC!H27,IF($D$21=$M$10,MC!K27,IF($D$21='Interactive Worksheet'!$M$11,MC!N27,IF($D$21='Interactive Worksheet'!$M$12,MC!Q27,IF($D$21='Interactive Worksheet'!$M$13,MC!T27,))))))","v":{"$error":"#N/A"}},{"$f":"(H61/125)*1","v":0}]
[{"$f":"IF(OR($D$26<>\"Yes\",$D$26=0,$K$26<>\"Yes\"),,'Components and Space Standards'!A28)","v":0},null,null,null,{"$f":"IF(OR($D$26<>\"Yes\",$D$26=0,$K$26<>\"Yes\"),,IF($D$5=$K$5,$M62&\" \"&'Components and Space Standards'!$D28&\".\",IF($D$5=$K$6,$O62&\" \"&'Components and Space Standards'!$D28&\".\",IF($D$5=$K$7,$Q62&\" \"&'Components and Space Standards'!$D28&\".\",IF($D$5=$K$8,$S62&\" \"&'Components and Space Standards'!$D28&\".\",)))))","v":0},null,0,0,null,null,null,null,{"$f":"IF($D62<>0,$D62,IF($D$21=$M$9,Army!$F28,IF($D$21=$M$10,Army!$I28,IF($D$21='Interactive Worksheet'!$M$11,Army!$L28,IF($D$21='Interactive Worksheet'!$M$12,Army!$O28,IF($D$21='Interactive Worksheet'!$M$13,IF($M$17=0,Army!$R28,($M$17*Army!U28)+Army!R28)))))))","v":{"$error":"#N/A"}},{"$f":"IF($D62<>0,$D62*'Components and Space Standards'!$C28,IF($D$21=$M$9,Army!$H28,IF($D$21=$M$10,Army!$K28,IF($D$21='Interactive Worksheet'!$M$11,Army!$N28,IF($D$21='Interactive Worksheet'!$M$12,Army!$Q28,IF($D$21='Interactive Worksheet'!$M$13,IF($M$17=0,Army!$T28,($M$17*Army!W28)+Army!T28)))))))","v":{"$error":"#N/A"}},{"$f":"IF(D62<>0,D62,IF($D$21=$M$9,Navy!F28,IF($D$21=$M$10,Navy!I28,IF($D$21='Interactive Worksheet'!$M$11,Navy!L28,IF($D$21='Interactive Worksheet'!$M$12,Navy!O28,IF($D$21='Interactive Worksheet'!$M$13,Navy!R28,IF($O$18>0,Navy!U28,)))))))","v":{"$error":"#N/A"}},{"$f":"IF(D62<>0,D62*'Components and Space Standards'!C28,IF($D$21=$M$9,Navy!H28,IF($D$21=$M$10,Navy!K28,IF($D$21='Interactive Worksheet'!$M$11,Navy!N28,IF($D$21='Interactive Worksheet'!$M$12,Navy!Q28,IF($D$21='Interactive Worksheet'!$M$13,Navy!T28,IF($O$18>0,Navy!W28,)))))))","v":{"$error":"#N/A"}},{"$f":"IF(D62<>0,D62,IF($D$21=$M$10,AF!F28,IF($D$21=$M$11,AF!I28,IF($D$21='Interactive Worksheet'!$M$12,AF!L28,))))","v":{"$error":"#N/A"}},{"$f":"IF(D62<>0,D62*'Components and Space Standards'!C28,IF($D$21=$M$10,AF!H28,IF($D$21=$M$11,AF!K28,IF($D$21='Interactive Worksheet'!$M$12,AF!N28,))))","v":{"$error":"#N/A"}},{"$f":"IF($D62<>0,$D62,IF($D$21=$M$9,MC!F28,IF($D$21=$M$10,MC!I28,IF($D$21='Interactive Worksheet'!$M$11,MC!L28,IF($D$21='Interactive Worksheet'!$M$12,MC!O28,IF($D$21='Interactive Worksheet'!$M$13,MC!R28,))))))","v":{"$error":"#N/A"}},{"$f":"IF($D62<>0,$D62*'Components and Space Standards'!C28,IF($D$21=$M$9,MC!H28,IF($D$21=$M$10,MC!K28,IF($D$21='Interactive Worksheet'!$M$11,MC!N28,IF($D$21='Interactive Worksheet'!$M$12,MC!Q28,IF($D$21='Interactive Worksheet'!$M$13,MC!T28,))))))","v":{"$error":"#N/A"}}]
[{"$f":"IF(OR($D$26<>\"Yes\",$D$26=0,$K$26<>\"Yes\"),,'Components and Space Standards'!A29)","v":0},null,null,null,null,null,0,{"$f":"IF(OR($D$26<>\"Yes\",$D$26=0,$K$26<>\"Yes\"),,IF($D$5=$K$5,N63,IF($D$5=$K$6,P63,IF($D$5=$K$7,R63,IF($D$5=$K$8,T63,)))))","v":0},null,null,null,null,{"$f":"IF($D63<>0,$D63,IF($D$21=$M$9,Army!$F29,IF($D$21=$M$10,Army!$I29,IF($D$21='Interactive Worksheet'!$M$11,Army!$L29,IF($D$21='Interactive Worksheet'!$M$12,Army!$O29,IF($D$21='Interactive Worksheet'!$M$13,IF($M$17=0,Army!$R29,($M$17*Army!U29)+Army!R29)))))))","v":{"$error":"#N/A"}},{"$f":"IF($D63<>0,$D63*'Components and Space Standards'!$C29,IF($D$21=$M$9,Army!$H29,IF($D$21=$M$10,Army!$K29,IF($D$21='Interactive Worksheet'!$M$11,Army!$N29,IF($D$21='Interactive Worksheet'!$M$12,Army!$Q29,IF($D$21='Interactive Worksheet'!$M$13,IF($M$17=0,Army!$T29,($M$17*Army!W29)+Army!T29)))))))","v":{"$error":"#N/A"}},{"$f":"IF(D63<>0,D63,IF($D$21=$M$9,Navy!F29,IF($D$21=$M$10,Navy!I29,IF($D$21='Interactive Worksheet'!$M$11,Navy!L29,IF($D$21='Interactive Worksheet'!$M$12,Navy!O29,IF($D$21='Interactive Worksheet'!$M$13,Navy!R29,IF($O$18>0,Navy!U29,)))))))","v":{"$error":"#N/A"}},{"$f":"IF(D63<>0,D63*'Components and Space Standards'!C29,IF($D$21=$M$9,Navy!H29,IF($D$21=$M$10,Navy!K29,IF($D$21='Interactive Worksheet'!$M$11,Navy!N29,IF($D$21='Interactive Worksheet'!$M$12,Navy!Q29,IF($D$21='Interactive Worksheet'!$M$13,Navy!T29,IF($O$18>0,Navy!W29,)))))))","v":{"$error":"#N/A"}},{"$f":"IF(D63<>0,D63,IF($D$21=$M$10,AF!F29,IF($D$21=$M$11,AF!I29,IF($D$21='Interactive Worksheet'!$M$12,AF!L29,))))","v":{"$error":"#N/A"}},{"$f":"IF(D63<>0,D63*'Components and Space Standards'!C29,IF($D$21=$M$10,AF!H29,IF($D$21=$M$11,AF!K29,IF($D$21='Interactive Worksheet'!$M$12,AF!N29,))))","v":{"$error":"#N/A"}},{"$f":"IF($D63<>0,$D63,IF($D$21=$M$9,MC!F29,IF($D$21=$M$10,MC!I29,IF($D$21='Interactive Worksheet'!$M$11,MC!L29,IF($D$21='Interactive Worksheet'!$M$12,MC!O29,IF($D$21='Interactive Worksheet'!$M$13,MC!R29,))))))","v":{"$error":"#N/A"}},{"$f":"IF($D63<>0,$D63*'Components and Space Standards'!$C$5,IF($D$21=$M$9,MC!H29,IF($D$21=$M$10,MC!K29,IF($D$21='Interactive Worksheet'!$M$11,MC!N29,IF($D$21='Interactive Worksheet'!$M$12,MC!Q29,IF($D$21='Interactive Worksheet'!$M$13,MC!T29,))))))","v":{"$error":"#N/A"}}]
[{"$f":"IF(OR($D$26<>\"Yes\",$D$26=0,$K$26<>\"Yes\"),,'Components and Space Standards'!A30)","v":0},null,{"$f":"IF(D5=K8,\"MC may incl cycling, climbing wall\",IF(D5=K6,\"Navy may incl cycling,climbing wall, FF\",))","v":0},null,{"$f":"IF(OR($D$26<>\"Yes\",$D$26=0,$K$26<>\"Yes\"),,IF($D$5=$K$5,$M64&\" \"&'Components and Space Standards'!$D30&\".\",IF($D$5=$K$6,$O64&\" \"&'Components and Space Standards'!$D30&\".\",IF($D$5=$K$7,$Q64&\" \"&'Components and Space Standards'!$D30&\".\",IF($D$5=$K$8,$S64&\" \"&'Components and Space Standards'!$D30&\".\",)))))","v":0},null,0,{"$f":"IF(OR($D$26<>\"Yes\",$D$26=0,$K$26<>\"Yes\"),,IF($D$5=$K$5,N64,IF($D$5=$K$6,P64,IF($D$5=$K$7,R64,IF($D$5=$K$8,T64,)))))","v":0},null,null,null,null,{"$f":"IF($D64<>0,$D64,IF($D$21=$M$9,Army!$F30,IF($D$21=$M$10,Army!$I30,IF($D$21='Interactive Worksheet'!$M$11,Army!$L30,IF($D$21='Interactive Worksheet'!$M$12,Army!$O30,IF($D$21='Interactive Worksheet'!$M$13,IF($M$17=0,Army!$R30,($M$17*Army!U30)+Army!R30)))))))","v":{"$error":"#N/A"}},{"$f":"IF($D64<>0,$D64*'Components and Space Standards'!$C30,IF($D$21=$M$9,Army!$H30,IF($D$21=$M$10,Army!$K30,IF($D$21='Interactive Worksheet'!$M$11,Army!$N30,IF($D$21='Interactive Worksheet'!$M$12,Army!$Q30,IF($D$21='Interactive Worksheet'!$M$13,IF($M$17=0,Army!$T30,($M$17*Army!W30)+Army!T30)))))))","v":{"$error":"#N/A"}},{"$f":"IF(D64<>0,D64,IF($D$21=$M$9,Navy!F30,IF($D$21=$M$10,Navy!I30,IF($D$21='Interactive Worksheet'!$M$11,Navy!L30,IF($D$21='Interactive Worksheet'!$M$12,Navy!O30,IF($D$21='Interactive Worksheet'!$M$13,Navy!R30,IF($O$18>0,Navy!U30,)))))))","v":{"$error":"#N/A"}},{"$f":"IF(D64<>0,D64*'Components and Space Standards'!C30,IF($D$21=$M$9,Navy!H30,IF($D$21=$M$10,Navy!K30,IF($D$21='Interactive Worksheet'!$M$11,Navy!N30,IF($D$21='Interactive Worksheet'!$M$12,Navy!Q30,IF($D$21='Interactive Worksheet'!$M$13,Navy!T30,IF($O$18>0,Navy!W30,)))))))","v":{"$error":"#N/A"}},{"$f":"IF(D64<>0,D64,IF($D$21=$M$10,AF!F30,IF($D$21=$M$11,AF!I30,IF($D$21='Interactive Worksheet'!$M$12,AF!L30,))))","v":{"$error":"#N/A"}},{"$f":"IF(D64<>0,D64*'Components and Space Standards'!C30,IF($D$21=$M$10,AF!H30,IF($D$21=$M$11,AF!K30,IF($D$21='Interactive Worksheet'!$M$12,AF!N30,))))","v":{"$error":"#N/A"}},{"$f":"IF($D64<>0,$D64,IF($D$21=$M$9,MC!F30,IF($D$21=$M$10,MC!I30,IF($D$21='Interactive Worksheet'!$M$11,MC!L30,IF($D$21='Interactive Worksheet'!$M$12,MC!O30,IF($D$21='Interactive Worksheet'!$M$13,MC!R30,))))))","v":{"$error":"#N/A"}},{"$f":"IF($D64<>0,$D64*'Components and Space Standards'!C30,IF($D$21=$M$9,MC!H30,IF($D$21=$M$10,MC!K30,IF($D$21='Interactive Worksheet'!$M$11,MC!N30,IF($D$21='Interactive Worksheet'!$M$12,MC!Q30,IF($D$21='Interactive Worksheet'!$M$13,MC!T30,))))))","v":{"$error":"#N/A"}},{"$f":"(H64/50)*1","v":0}]
[{"$f":"IF(OR($D$26<>\"Yes\",$D$26=0,$K$26<>\"Yes\"),,'Components and Space Standards'!A31)","v":0},null,null,null,{"$f":"IF(OR($D$26<>\"Yes\",$D$26=0,$K$26<>\"Yes\"),,IF($D$5=$K$5,$M65&\" \"&'Components and Space Standards'!$D31&\".\",IF($D$5=$K$6,$O65&\" \"&'Components and Space Standards'!$D31&\".\",IF($D$5=$K$7,$Q65&\" \"&'Components and Space Standards'!$D31&\".\",IF($D$5=$K$8,$S65&\" \"&'Components and Space Standards'!$D31&\".\",)))))","v":0},null,0,{"$f":"IF(OR($D$26<>\"Yes\",$D$26=0,$K$26<>\"Yes\"),,IF($D$5=$K$5,N65,IF($D$5=$K$6,P65,IF($D$5=$K$7,R65,IF($D$5=$K$8,T65,)))))","v":0},null,null,0,null,{"$f":"IF($D65<>0,$D65,IF($D$21=$M$9,Army!$F31,IF($D$21=$M$10,Army!$I31,IF($D$21='Interactive Worksheet'!$M$11,Army!$L31,IF($D$21='Interactive Worksheet'!$M$12,Army!$O31,IF($D$21='Interactive Worksheet'!$M$13,IF($M$17=0,Army!$R31,($M$17*Army!U31)+Army!R31)))))))","v":{"$error":"#N/A"}},{"$f":"IF($D65<>0,$D65*'Components and Space Standards'!$C31,IF($D$21=$M$9,Army!$H31,IF($D$21=$M$10,Army!$K31,IF($D$21='Interactive Worksheet'!$M$11,Army!$N31,IF($D$21='Interactive Worksheet'!$M$12,Army!$Q31,IF($D$21='Interactive Worksheet'!$M$13,IF($M$17=0,Army!$T31,($M$17*Army!W31)+Army!T31)))))))","v":{"$error":"#N/A"}},{"$f":"IF(D65<>0,D65,IF($D$21=$M$9,Navy!F31,IF($D$21=$M$10,Navy!I31,IF($D$21='Interactive Worksheet'!$M$11,Navy!L31,IF($D$21='Interactive Worksheet'!$M$12,Navy!O31,IF($D$21='Interactive Worksheet'!$M$13,Navy!R31,IF($O$18>0,Navy!U31,)))))))","v":{"$error":"#N/A"}},{"$f":"IF(D65<>0,D65*'Components and Space Standards'!C31,IF($D$21=$M$9,Navy!H31,IF($D$21=$M$10,Navy!K31,IF($D$21='Interactive Worksheet'!$M$11,Navy!N31,IF($D$21='Interactive Worksheet'!$M$12,Navy!Q31,IF($D$21='Interactive Worksheet'!$M$13,Navy!T31,IF($O$18>0,Navy!W31,)))))))","v":{"$error":"#N/A"}},{"$f":"IF(D65<>0,D65,IF($D$21=$M$10,AF!F31,IF($D$21=$M$11,AF!I31,IF($D$21='Interactive Worksheet'!$M$12,AF!L31,))))","v":{"$error":"#N/A"}},{"$f":"IF(D65<>0,D65*'Components and Space Standards'!C31,IF($D$21=$M$10,AF!H31,IF($D$21=$M$11,AF!K31,IF($D$21='Interactive Worksheet'!$M$12,AF!N31,))))","v":{"$error":"#N/A"}},{"$f":"IF($D65<>0,$D65,IF($D$21=$M$9,MC!F31,IF($D$21=$M$10,MC!I31,IF($D$21='Interactive Worksheet'!$M$11,MC!L31,IF($D$21='Interactive Worksheet'!$M$12,MC!O31,IF($D$21='Interactive Worksheet'!$M$13,MC!R31,))))))","v":{"$error":"#N/A"}},{"$f":"IF($D65<>0,$D65*'Components and Space Standards'!C31,IF($D$21=$M$9,MC!H31,IF($D$21=$M$10,MC!K31,IF($D$21='Interactive Worksheet'!$M$11,MC!N31,IF($D$21='Interactive Worksheet'!$M$12,MC!Q31,IF($D$21='Interactive Worksheet'!$M$13,MC!T31,))))))","v":{"$error":"#N/A"}},{"$f":"(H65/800)*4","v":0}]
[{"$f":"IF(OR($D$26<>\"Yes\",$D$26=0,$K$26<>\"Yes\",D5=K6),,'Components and Space Standards'!A32)","v":0},null,null,null,{"$f":"IF(OR($D$26<>\"Yes\",$D$26=0,$K$26<>\"Yes\"),,IF($D$5=$K$5,$M66&\" \"&'Components and Space Standards'!$D32&\".\",IF($D$5=$K$6,$O66&\" \"&'Components and Space Standards'!$D32&\".\",IF($D$5=$K$7,$Q66&\" \"&'Components and Space Standards'!$D32&\".\",IF($D$5=$K$8,$S66&\" \"&'Components and Space Standards'!$D32&\".\",)))))","v":0},null,{"$f":"ROUND(H66*$K$33,2)","v":0},{"$f":"IF(OR($D$26<>\"Yes\",$D$26=0,$K$26<>\"Yes\"),,IF($D$5=$K$5,N66,IF($D$5=$K$6,P66,IF($D$5=$K$7,R66,IF($D$5=$K$8,T66,)))))","v":0},null,null,{"$f":"IF($D$5=$K$8,2000,)","v":0},null,null,null,null,null,null,null,null,{"$f":"'Components and Space Standards'!C32","v":8892},{"$f":"(H66/800)*4","v":0}]
[{"$f":"IF(OR($D$26<>\"Yes\",$D$26=0,$K$26<>\"Yes\",D5=K6),,'Components and Space Standards'!A33)","v":0},null,{"$f":"IF(OR($D$26<>\"Yes\",$D$26=0,$K$26<>\"Yes\"),,IF(D5=K8,\"Select size of HITT Center\",))","v":0},null,{"$f":"IF(OR($D$26<>\"Yes\",$D$26=0,$K$26<>\"Yes\",D5=K6),,IF($D$5=$K$5,$M67&\" \"&'Components and Space Standards'!$D33&\".\",IF($D$5=$K$6,$O67&\" \"&'Components and Space Standards'!$D33&\".\",IF($D$5=$K$7,$Q67&\" \"&'Components and Space Standards'!$D33&\".\",IF($D$5=$K$8,\" \"&'Components and Space Standards'!$D33&\".\",)))))","v":0},null,{"$f":"ROUND(H67*$K$33,2)","v":0},{"$f":"IF(OR($D$26<>\"Yes\",$D$26=0,$K$26<>\"Yes\",D5=K6),,IF($D$5=$K$8,D67))","v":0},null,null,{"$f":"IF($D$5=$K$8,4000,)","v":0},null,{"$f":"IF($D67<>0,$D67,IF($D$21=$M$9,Army!$F33,IF($D$21=$M$10,Army!$I33,IF($D$21='Interactive Worksheet'!$M$11,Army!$L33,IF($D$21='Interactive Worksheet'!$M$12,Army!$O33,IF($D$21='Interactive Worksheet'!$M$13,IF($M$17=0,Army!$R33,($M$17*Army!U33)+Army!R33)))))))","v":{"$error":"#N/A"}},{"$f":"IF($D67<>0,$D67*'Components and Space Standards'!$C33,IF($D$21=$M$9,Army!$H33,IF($D$21=$M$10,Army!$K33,IF($D$21='Interactive Worksheet'!$M$11,Army!$N33,IF($D$21='Interactive Worksheet'!$M$12,Army!$Q33,IF($D$21='Interactive Worksheet'!$M$13,IF($M$17=0,Army!$T33,($M$17*Army!W33)+Army!T33)))))))","v":{"$error":"#N/A"}},{"$f":"IF(D67<>0,D67,IF($D$21=$M$9,Navy!F33,IF($D$21=$M$10,Navy!I33,IF($D$21='Interactive Worksheet'!$M$11,Navy!L33,IF($D$21='Interactive Worksheet'!$M$12,Navy!O33,IF($D$21='Interactive Worksheet'!$M$13,Navy!R33,IF($O$18>0,Navy!U33,)))))))","v":{"$error":"#N/A"}},{"$f":"IF(D67<>0,D67*'Components and Space Standards'!C33,IF($D$21=$M$9,Navy!H33,IF($D$21=$M$10,Navy!K33,IF($D$21='Interactive Worksheet'!$M$11,Navy!N33,IF($D$21='Interactive Worksheet'!$M$12,Navy!Q33,IF($D$21='Interactive Worksheet'!$M$13,Navy!T33,IF($O$18>0,Navy!W33,)))))))","v":{"$error":"#N/A"}},{"$f":"IF(D67<>0,D67,IF($D$21=$M$10,AF!F33,IF($D$21=$M$11,AF!I33,IF($D$21='Interactive Worksheet'!$M$12,AF!L33,))))","v":{"$error":"#N/A"}},{"$f":"IF(D67<>0,D67*'Components and Space Standards'!C33,IF($D$21=$M$10,AF!H33,IF($D$21=$M$11,AF!K33,IF($D$21='Interactive Worksheet'!$M$12,AF!N33,))))","v":{"$error":"#N/A"}},{"$f":"IF($D67<>0,$D67,IF($D$21=$M$9,MC!F33,IF($D$21=$M$10,MC!I33,IF($D$21='Interactive Worksheet'!$M$11,MC!L33,IF($D$21='Interactive Worksheet'!$M$12,MC!O33,IF($D$21='Interactive Worksheet'!$M$13,MC!R33,))))))","v":{"$error":"#N/A"}},{"$f":"IF($D67<>0,$D67*'Components and Space Standards'!C33,IF($D$21=$M$9,MC!H33,IF($D$21=$M$10,MC!K33,IF($D$21='Interactive Worksheet'!$M$11,MC!N33,IF($D$21='Interactive Worksheet'!$M$12,MC!Q33,IF($D$21='Interactive Worksheet'!$M$13,MC!T33,))))))","v":{"$error":"#N/A"}},{"$f":"(H67/800)*4","v":0}]
[{"$f":"IF(OR($D$26<>\"Yes\",$D$26=0,$K$26<>\"Yes\",D5=K6),,'Components and Space Standards'!A34)","v":0},null,{"$f":"IF(OR($D$26<>\"Yes\",$D$26=0,$K$26<>\"Yes\",D5=K6),,\"Select # of court modules, max. 2\")","v":0},null,{"$f":"IF(OR($D$26<>\"Yes\",$D$26=0,$K$26<>\"Yes\",$D$5=$K$6),,IF($D$5=$K$5,$M68&\" \"&'Components and Space Standards'!$D34&\".\",IF($D$5=$K$6,$O68&\" \"&'Components and Space Standards'!$D34&\".\",IF($D$5=$K$7,$Q68&\" \"&'Components and Space Standards'!$D34&\".\",IF($D$5=$K$8,$S68&\" \"&'Components and Space Standards'!$D34&\".\",)))))","v":0},null,0,{"$f":"IF(OR($D$26<>\"Yes\",$D$26=0,$K$26<>\"Yes\",$D$5=$K$6),,IF($D$5=$K$5,N68,IF($D$5=$K$6,P68,IF($D$5=$K$7,R68,IF($D$5=$K$8,T68,)))))","v":0},null,null,{"$f":"IF($D$5=$K$8,1,)","v":0},null,{"$f":"IF($D68<>0,$D68,IF($D$21=$M$9,Army!$F32,IF($D$21=$M$10,Army!$I32,IF($D$21='Interactive Worksheet'!$M$11,Army!$L32,IF($D$21='Interactive Worksheet'!$M$12,Army!$O32,IF($D$21='Interactive Worksheet'!$M$13,IF($M$17=0,Army!$R32,($M$17*Army!U32)+Army!R32)))))))","v":{"$error":"#N/A"}},{"$f":"IF($D68<>0,$D68*'Components and Space Standards'!$C34,IF($D$21=$M$9,Army!$H32,IF($D$21=$M$10,Army!$K32,IF($D$21='Interactive Worksheet'!$M$11,Army!$N32,IF($D$21='Interactive Worksheet'!$M$12,Army!$Q32,IF($D$21='Interactive Worksheet'!$M$13,IF($M$17=0,Army!$T32,($M$17*Army!W32)+Army!T32)))))))","v":{"$error":"#N/A"}},{"$f":"IF(D68<>0,D68,IF($D$21=$M$9,Navy!F32,IF($D$21=$M$10,Navy!I32,IF($D$21='Interactive Worksheet'!$M$11,Navy!L32,IF($D$21='Interactive Worksheet'!$M$12,Navy!O32,IF($D$21='Interactive Worksheet'!$M$13,Navy!R32,IF($O$18>0,Navy!U32,)))))))","v":{"$error":"#N/A"}},{"$f":"IF(D68<>0,D68*'Components and Space Standards'!C34,IF($D$21=$M$9,Navy!H32,IF($D$21=$M$10,Navy!K32,IF($D$21='Interactive Worksheet'!$M$11,Navy!N32,IF($D$21='Interactive Worksheet'!$M$12,Navy!Q32,IF($D$21='Interactive Worksheet'!$M$13,Navy!T32,IF($O$18>0,Navy!W32,)))))))","v":{"$error":"#N/A"}},{"$f":"IF(D68<>0,D68,IF($D$21=$M$10,AF!F32,IF($D$21=$M$11,AF!I32,IF($D$21='Interactive Worksheet'!$M$12,AF!L32,))))","v":{"$error":"#N/A"}},{"$f":"IF(D68<>0,D68*'Components and Space Standards'!C34,IF($D$21=$M$10,AF!H32,IF($D$21=$M$11,AF!K32,IF($D$21='Interactive Worksheet'!$M$12,AF!N32,))))","v":{"$error":"#N/A"}},{"$f":"D68","v":0},{"$f":"S68*200","v":0}]
[{"$f":"IF(OR($D$26<>\"Yes\",$D$26=0,$K$26<>\"Yes\"),,'Components and Space Standards'!A35)","v":0},null,null,null,{"$f":"IF(OR($D$26<>\"Yes\",$D$26=0,$K$26<>\"Yes\"),,IF($D$5=$K$5,$M69&\" \"&'Components and Space Standards'!$D35&\".\",IF($D$5=$K$6,$O69&\" \"&'Components and Space Standards'!$D35&\".\",IF($D$5=$K$7,$Q69&\" \"&'Components and Space Standards'!$D35&\".\",IF($D$5=$K$8,$S69&\" \"&'Components and Space Standards'!$D35&\".\",)))))","v":0},null,{"$f":"ROUND(H69*$K$33,2)","v":0},{"$f":"IF(OR($D$26<>\"Yes\",$D$26=0,$K$26<>\"Yes\"),,IF($D$5=$K$5,N69,IF($D$5=$K$6,P69,IF($D$5=$K$7,R69,IF($D$5=$K$8,T69,)))))","v":0},null,null,{"$f":"IF($D$5=$K$8,2,)","v":0},null,null,{"$f":"0.1*N64","v":{"$error":"#N/A"}},null,{"$f":"0.1*P64","v":{"$error":"#N/A"}},null,{"$f":"0.1*R64","v":{"$error":"#N/A"}},null,{"$f":"0.1*T64","v":{"$error":"#N/A"}}]
[{"$f":"IF(OR($D$26<>\"Yes\",$D$26=0,$K$26<>\"Yes\"),,'Components and Space Standards'!A36)","v":0},null,null,null,null,null,null,null,null,null,null,null,"Break in sequence - Rows 68 to 70.  Refs to Space sheet for rows 35 to 42 are below."]
[{"$f":"IF(OR($D$26<>\"Yes\",$D$26=0,$K$26<>\"Yes\"),,\"Space criteria for men's and women's locker, shower, and toilet areas are provided at the end of the spreadsheet because they are determined by selections made throughout.\")","v":0}]
[]
[null,null,null,null,null,null,null,null,null,null,"None"]
[{"$f":"IF(OR($D$26<>\"Yes\",$D$26=0,$K$26<>\"Yes\"),,'Components and Space Standards'!A45)","v":0},null,{"$f":"IF(OR($D$26<>\"Yes\",$D$26=0,$K$26<>\"Yes\",D5=K6),,\"To change default, select new:\")","v":0},"None",{"$f":"IF(OR($D$26<>\"Yes\",$D$26=0,$K$26<>\"Yes\",D5=K6),,IF($D$5=$K$5,$M74&\" \"&'Components and Space Standards'!$D45&\".\",IF($D$5=$K$6,$O74&\" \"&'Components and Space Standards'!$D45&\".\",IF($D$5=$K$7,$Q74&\" \"&'Components and Space Standards'!$D45&\".\",IF($D$5=$K$8,$S74&\" \"&'Components and Space Standards'!$D45&\".\",)))))","v":0},null,{"$f":"ROUND(H74*$K$33,2)","v":0},{"$f":"IF(OR($D$26<>\"Yes\",$D$26=0,$K$26<>\"Yes\"),,IF($D$5=$K$5,N74,IF($D$5=$K$6,P74,IF($D$5=$K$7,R74,IF($D$5=$K$8,T74,)))))","v":0},null,{"$f":"IF(D74<>0,\"D\",)","v":"D"},"Small",null,{"$f":"IF($D74<>0,\"Error\",IF($D$21=$M$9,Army!$F43,IF($D$21=$M$10,Army!$I43,IF($D$21='Interactive Worksheet'!$M$11,Army!$L43,IF($D$21='Interactive Worksheet'!$M$12,Army!$O43,IF($D$21='Interactive Worksheet'!$M$13,IF($M$17=0,Army!$R43,$M$17&\" \"&Army!U43&\" & 1 \"&Army!R43)))))))","v":"Error"},{"$f":"IF(M74=\"Small\",(80*2),IF(M74=\"Medium\",(120*2),IF(M74=\"Large\",(144*2),(M17*(80*2))+(144*2))))","v":288},{"$f":"IF($D74<>0,$D74,IF($D$21=$M$9,MC!B43,IF($D$21=$M$10,MC!E43,IF($D$21='Interactive Worksheet'!$M$11,MC!H43,IF($D$21='Interactive Worksheet'!$M$12,MC!K43,IF($D$21='Interactive Worksheet'!$M$13,MC!N43,))))))","v":"None"},{"$f":"IF(O74=\"None\",,IF(O74=\"Small\",(80*2),IF(O74=\"Medium\",(120*2),IF(O74=\"Large\",(144*2),))))","v":0},{"$f":"IF($D74<>0,$D74,IF($D$21=$M$10,AF!F43,IF($D$21=$M$11,AF!I43,IF($D$21=$M$12,AF!L43,))))","v":"None"},{"$f":"IF(Q74=\"Small\",(80*2),IF(Q74=\"Medium\",(120*2),IF(Q74=\"Large\",(144*2),)))","v":0},{"$f":"IF($D74<>0,$D74,IF($D$21=$M$9,MC!F43,IF($D$21=$M$10,MC!I43,IF($D$21='Interactive Worksheet'!$M$11,MC!L43,IF($D$21='Interactive Worksheet'!$M$12,MC!O43,IF($D$21='Interactive Worksheet'!$M$13,MC!R43,))))))","v":"None"},{"$f":"IF(S74=\"Small\",(80*2),IF(S74=\"Medium\",(120*2),IF(S74=\"Large\",(144*2),)))","v":0},{"$f":"IF(H74=160,6,IF(H74=240,9,IF(H74=288,12,0)))","v":0}]
[null,null,null,null,null,null,{"$f":"ROUND(H75*$K$33,2)","v":0},{"$f":"IF(OR($D$26<>\"Yes\",$D$26=0,$K$26<>\"Yes\"),,IF($D$5=$K$5,N75,IF($D$5=$K$6,P75,IF($D$5=$K$7,R75,IF($D$5=$K$8,T75,)))))","v":0},null,{"$f":"IF(D75<>0,\"D\",)","v":0},"Medium",null,{"$f":"IF($D75<>0,\"Error\",IF($D$21=$M$9,Army!$F44,IF($D$21=$M$10,Army!$I44,IF($D$21='Interactive Worksheet'!$M$11,Army!$L44,IF($D$21='Interactive Worksheet'!$M$12,Army!$O44,IF($D$21='Interactive Worksheet'!$M$13,IF($M$17=0,Army!$R44,($M$17*Army!U44)+Army!R44)))))))","v":{"$error":"#N/A"}},null,{"$f":"IF($D75<>0,$D75,IF($D$21=$M$9,Navy!F44,IF($D$21=$M$10,Navy!I44,IF($D$21='Interactive Worksheet'!$M$11,Navy!L44,IF($D$21='Interactive Worksheet'!$M$12,Navy!O44,IF($D$21='Interactive Worksheet'!$M$13,Navy!R44,IF($O$18>0,Navy!U44,)))))))","v":{"$error":"#N/A"}},null,{"$f":"IF($D75<>0,$D75,IF($D$21=$M$10,AF!F44,IF($D$21=$M$11,AF!I44,IF($D$21=$M$12,AF!L44,))))","v":{"$error":"#N/A"}},null,{"$f":"IF($D75<>0,\"Error\",IF($D$21=$M$9,MC!F44,IF($D$21=$M$10,MC!I44,IF($D$21='Interactive Worksheet'!$M$11,MC!L44,IF($D$21='Interactive Worksheet'!$M$12,MC!O44,IF($D$21='Interactive Worksheet'!$M$13,MC!R44,))))))","v":{"$error":"#N/A"}},null,{"$f":"IF(H75=184,7,IF(H75=268,9,IF(H75=330,14,0)))","v":0}]
[null,null,null,null,null,null,{"$f":"ROUND(H76*$K$33,2)","v":0},{"$f":"IF(OR($D$26<>\"Yes\",$D$26=0,$K$26<>\"Yes\"),,IF($D$5=$K$5,N76,IF($D$5=$K$6,P76,IF($D$5=$K$7,R76,IF($D$5=$K$8,T76,)))))","v":0},null,{"$f":"IF(D76<>0,\"D\",)","v":0},"Large",null,{"$f":"IF($D76<>0,\"Error\",IF($D$21=$M$9,Army!$F45,IF($D$21=$M$10,Army!$I45,IF($D$21='Interactive Worksheet'!$M$11,Army!$L45,IF($D$21='Interactive Worksheet'!$M$12,Army!$O45,IF($D$21='Interactive Worksheet'!$M$13,IF($M$17=0,Army!$R45,($M$17*Army!U45)+Army!R45)))))))","v":{"$error":"#N/A"}},null,{"$f":"IF($D76<>0,$D76,IF($D$21=$M$9,Navy!F45,IF($D$21=$M$10,Navy!I45,IF($D$21='Interactive Worksheet'!$M$11,Navy!L45,IF($D$21='Interactive Worksheet'!$M$12,Navy!O45,IF($D$21='Interactive Worksheet'!$M$13,Navy!R45,IF($O$18>0,Navy!U45,)))))))","v":{"$error":"#N/A"}},null,{"$f":"IF($D76<>0,$D76,IF($D$21=$M$10,AF!F45,IF($D$21=$M$11,AF!I45,IF($D$21=$M$12,AF!L45,))))","v":{"$error":"#N/A"}},null,{"$f":"IF($D76<>0,$D76,IF($D$21=$M$9,MC!F45,IF($D$21=$M$10,MC!I45,IF($D$21='Interactive Worksheet'!$M$11,MC!L45,IF($D$21='Interactive Worksheet'!$M$12,MC!O45,IF($D$21='Interactive Worksheet'!$M$13,MC!R45,))))))","v":{"$error":"#N/A"}},null,{"$f":"IF(H76=90,5,IF(H76=126,8,IF(H76=160,14,0)))","v":0}]
[]
[{"$f":"IF(OR($D$26<>\"Yes\",$D$26=0,$K$26<>\"Yes\"),,'Components and Space Standards'!A3&\" (continued)\")","v":0},null,null,null,"Default quantities",null," m2","ft.2"]
[{"$f":"IF(OR($D$26<>\"Yes\",$D$26=0,$K$26<>\"Yes\"),,'Components and Space Standards'!A48)","v":0}]
[{"$f":"IF(OR($D$26<>\"Yes\",$D$26=0,$K$26<>\"Yes\"),,'Components and Space Standards'!A49)","v":0},null,{"$f":"IF(OR($D$26<>\"Yes\",$D$26=0,$K$26<>\"Yes\"),,\"To change default, select new:\")","v":0},null,{"$f":"IF(OR($D$26<>\"Yes\",$D$26=0,$K$26<>\"Yes\"),,IF($D$5=$K$5,$M80&\" \"&'Components and Space Standards'!$D49&\".\",IF($D$5=$K$6,$O80&\" \"&'Components and Space Standards'!$D49&\".\",IF($D$5=$K$7,$Q80&\" \"&'Components and Space Standards'!$D49&\".\",IF($D$5=$K$8,$S80&\" \"&'Components and Space Standards'!$D49&\".\",)))))","v":0},null,0,{"$f":"IF(OR($D$26<>\"Yes\",$D$26=0,$K$26<>\"Yes\"),,IF($D$5=$K$5,N80,IF($D$5=$K$6,P80,IF($D$5=$K$7,R80,IF($D$5=$K$8,T80,)))))","v":0},null,{"$f":"IF(D80<>0,\"D\",)","v":0},"1/2 machine combo",null,{"$f":"IF($D80<>0,\"Error\",IF($D$21=$M$9,Army!$F47,IF($D$21=$M$10,Army!$I47,IF($D$21='Interactive Worksheet'!$M$11,Army!$L47,IF($D$21='Interactive Worksheet'!$M$12,Army!$O47,IF($D$21='Interactive Worksheet'!$M$13,IF($M$17=0,Army!$R47,K84)))))))","v":{"$error":"#N/A"}},{"$f":"IF(M80=$K$80,180,IF(M80=$K$81,230,IF(M80=$K$82,315,IF(M80=$K$83,385,IF(M80=$K$84,480,)))))","v":{"$error":"#N/A"}},{"$f":"IF(D80<>0,D80,IF($D$21=$M$9,Navy!F47,IF($D$21=$M$10,Navy!I47,IF($D$21='Interactive Worksheet'!$M$11,Navy!L47,IF($D$21='Interactive Worksheet'!$M$12,Navy!O47,IF($D$21='Interactive Worksheet'!$M$13,Navy!R47,IF($D$21='Interactive Worksheet'!$M$14,Navy!U47,)))))))","v":{"$error":"#N/A"}},{"$f":"IF(O80=$K$80,180,IF(O80=$K$81,230,IF(O80=$K$82,315,IF(O80=$K$83,385,IF(O80=$K$84,480,)))))","v":{"$error":"#N/A"}},{"$f":"IF($D80<>0,$D80,IF($D$21=$M$10,AF!F47,IF($D$21=$M$11,AF!I47,IF($D$21=$M$12,AF!L47,))))","v":{"$error":"#N/A"}},{"$f":"IF(Q80=$K$80,180,IF(Q80=$K$81,230,IF(Q80=$K$82,315,IF(Q80=$K$83,385,IF(Q80=$K$84,480,)))))","v":{"$error":"#N/A"}},{"$f":"IF($D80<>0,$D80,IF($D$21=$M$9,Navy!F47,IF($D$21=$M$10,Navy!I47,IF($D$21='Interactive Worksheet'!$M$11,Navy!L47,IF($D$21='Interactive Worksheet'!$M$12,Navy!O47,IF($D$21='Interactive Worksheet'!$M$13,Navy!R47,IF($D$21='Interactive Worksheet'!$M$14,Navy!U47,)))))))","v":{"$error":"#N/A"}},{"$f":"IF(S80=$K$80,180,IF(S80=$K$81,230,IF(S80=$K$82,315,IF(S80=$K$83,385,IF(S80=$K$84,480,)))))","v":{"$error":"#N/A"}}]
[{"$f":"IF(OR($D$26<>\"Yes\",$D$26=0,$K$26<>\"Yes\"),,'Components and Space Standards'!A50)","v":0},null,null,null,{"$f":"IF(OR($D$26<>\"Yes\",$D$26=0,$K$26<>\"Yes\"),,IF($D$5=$K$5,$M81&\" \"&'Components and Space Standards'!$D50&\".\",IF($D$5=$K$6,$O81&\" \"&'Components and Space Standards'!$D50&\".\",IF($D$5=$K$7,$Q81&\" \"&'Components and Space Standards'!$D50&\".\",IF($D$5=$K$8,$S81&\" \"&'Components and Space Standards'!$D50&\".\",)))))","v":0},null,0,{"$f":"IF(OR($D$26<>\"Yes\",$D$26=0,$K$26<>\"Yes\"),,IF($D$5=$K$5,N81,IF($D$5=$K$6,P81,IF($D$5=$K$7,R81,IF($D$5=$K$8,T81,)))))","v":0},null,null,"2/4 machine combo",null,null,{"$f":"(15*10)+(0.1*N56)","v":{"$error":"#N/A"}},null,{"$f":"(15*10)+(0.1*P56)","v":{"$error":"#N/A"}},null,{"$f":"(15*10)+(0.1*R56)","v":{"$error":"#N/A"}},null,{"$f":"(15*10)+(0.1*T56)","v":{"$error":"#N/A"}}]
[{"$f":"IF(OR($D$26<>\"Yes\",$D$26=0,$K$26<>\"Yes\"),,'Components and Space Standards'!A51)","v":0},null,null,null,{"$f":"IF(OR($D$26<>\"Yes\",$D$26=0,$K$26<>\"Yes\"),,IF($D$5=$K$5,$M82&\" \"&'Components and Space Standards'!$D51&\".\",IF($D$5=$K$6,$O82&\" \"&'Components and Space Standards'!$D51&\".\",IF($D$5=$K$7,$Q82&\" \"&'Components and Space Standards'!$D51&\".\",IF($D$5=$K$8,$S82&\" \"&'Components and Space Standards'!$D51&\".\",)))))","v":0},null,0,{"$f":"IF(OR($D$26<>\"Yes\",$D$26=0,$K$26<>\"Yes\"),,IF($D$5=$K$5,N82,IF($D$5=$K$6,P82,IF($D$5=$K$7,R82,IF($D$5=$K$8,T82,)))))","v":0},null,null,"3/6 machine combo",null,null,{"$f":"0.05*N56","v":{"$error":"#N/A"}},null,{"$f":"0.05*P56","v":{"$error":"#N/A"}},null,{"$f":"0.05*R56","v":{"$error":"#N/A"}},null,{"$f":"0.05*T56","v":{"$error":"#N/A"}}]
[{"$f":"IF(OR($D$26<>\"Yes\",$D$26=0,$K$26<>\"Yes\"),,'Components and Space Standards'!A52)","v":0},null,{"$f":"IF(OR($D$26<>\"Yes\",$D$26=0,$K$26<>\"Yes\"),,\"For this option, enter required sf:\")","v":0},null,{"$f":"IF(OR($D$26<>\"Yes\",$D$26=0,$K$26<>\"Yes\"),,H83&\" \"&'Components and Space Standards'!$D52&\".\")","v":0},null,{"$f":"ROUND(H83*$K$33,2)","v":0},{"$f":"IF(OR($D$26<>\"Yes\",$D$26=0,$K$26<>\"Yes\"),,IF($D$5=$K$5,N83,IF($D$5=$K$6,P83,IF($D$5=$K$7,R83,IF($D$5=$K$8,T83,)))))","v":0},null,{"$f":"IF(D83<>0,\"D\",)","v":0},"4/8 machine combo",null,null,{"$f":"IF($D$21=$M$9,Army!$H50,IF($D$21=$M$10,Army!$K50,IF($D$21='Interactive Worksheet'!$M$11,Army!$N50,IF($D$21='Interactive Worksheet'!$M$12,Army!$Q50,IF($D$21='Interactive Worksheet'!$M$13,IF($M$17=0,Army!$T50,($M$17*Army!W50)+Army!T50))))))","v":{"$error":"#N/A"}},{"$f":"IF(D83<>0,D83,IF($D$21=$M$9,Navy!F50,IF($D$21=$M$10,Navy!I50,IF($D$21='Interactive Worksheet'!$M$11,Navy!L50,IF($D$21='Interactive Worksheet'!$M$12,Navy!O50,IF($D$21='Interactive Worksheet'!$M$13,Navy!R50,IF($O$18>0,Navy!U50,)))))))","v":{"$error":"#N/A"}},{"$f":"IF($D83<>0,$D83,IF($D$21=$M$9,Navy!$H50,IF($D$21=$M$10,Navy!$K50,IF($D$21='Interactive Worksheet'!$M$11,Navy!$N50,IF($D$21='Interactive Worksheet'!$M$12,Navy!$Q50,IF($D$21='Interactive Worksheet'!$M$13,Navy!$T50,))))))","v":{"$error":"#N/A"}},{"$f":"IF(D83<>0,D83,IF($D$21=$M$10,AF!F50,IF($D$21=$M$11,AF!I50,IF($D$21='Interactive Worksheet'!$M$12,AF!L50,))))","v":{"$error":"#N/A"}},{"$f":"IF(D83<>0,D83,IF($D$21=$M$10,AF!H50,IF($D$21=$M$11,AF!K50,IF($D$21='Interactive Worksheet'!$M$12,AF!N50,))))","v":{"$error":"#N/A"}},{"$f":"IF($D83<>0,$D83,IF($D$21=$M$9,MC!F50,IF($D$21=$M$10,MC!I50,IF($D$21='Interactive Worksheet'!$M$11,MC!L50,IF($D$21='Interactive Worksheet'!$M$12,MC!O50,IF($D$21='Interactive Worksheet'!$M$13,MC!R50,))))))","v":{"$error":"#N/A"}},{"$f":"IF($D83<>0,$D83,IF($D$21=$M$9,MC!H50,IF($D$21=$M$10,MC!K50,IF($D$21='Interactive Worksheet'!$M$11,MC!N50,IF($D$21='Interactive Worksheet'!$M$12,MC!Q50,IF($D$21='Interactive Worksheet'!$M$13,MC!T50,))))))","v":{"$error":"#N/A"}}]
[{"$f":"IF(OR($D$26<>\"Yes\",$D$26=0,$K$26<>\"Yes\"),,'Components and Space Standards'!A53)","v":0},null,null,null,null,null,{"$f":"ROUND(H84*$K$33,2)","v":0},{"$f":"IF(OR($D$26<>\"Yes\",$D$26=0,$K$26<>\"Yes\"),,IF($D$5=$K$5,N84,IF($D$5=$K$6,P84,IF($D$5=$K$7,R84,IF($D$5=$K$8,T84,)))))","v":0},null,null,"5/10 machine combo",null,null,null,null,{"$f":"IF(D84<>0,D84*'Components and Space Standards'!C53,IF($D$21=$M$9,Navy!H51,IF($D$21=$M$10,Navy!K51,IF($D$21='Interactive Worksheet'!$M$11,Navy!N51,IF($D$21='Interactive Worksheet'!$M$12,Navy!Q51,IF($D$21='Interactive Worksheet'!$M$13,Navy!T51,IF($O$18>0,Navy!W51,)))))))","v":{"$error":"#N/A"}},null,null,{"$f":"IF($D84<>0,$D84,IF($D$21=$M$9,MC!F48,IF($D$21=$M$10,MC!I48,IF($D$21='Interactive Worksheet'!$M$11,MC!L48,IF($D$21='Interactive Worksheet'!$M$12,MC!O48,IF($D$21='Interactive Worksheet'!$M$13,MC!R48,))))))","v":{"$error":"#N/A"}},{"$f":"IF($D84<>0,$D84*'Components and Space Standards'!C53,IF($D$21=$M$9,MC!H51,IF($D$21=$M$10,MC!K51,IF($D$21='Interactive Worksheet'!$M$11,MC!N51,IF($D$21='Interactive Worksheet'!$M$12,MC!Q51,IF($D$21='Interactive Worksheet'!$M$13,MC!T51,))))))","v":{"$error":"#N/A"}}]
[{"$f":"IF(OR($D$26<>\"Yes\",$D$26=0,$K$26<>\"Yes\"),,'Components and Space Standards'!A54)","v":0}]
[{"$f":"IF(OR($D$26<>\"Yes\",$D$26=0,$K$26<>\"Yes\"),,'Components and Space Standards'!A55)","v":0},null,null,null,{"$f":"IF(OR($D$26<>\"Yes\",$D$26=0,$K$26<>\"Yes\"),,IF($D$5=$K$5,$M86&\" \"&'Components and Space Standards'!$D55&\".\",IF($D$5=$K$6,$O86&\" \"&'Components and Space Standards'!$D55&\".\",IF($D$5=$K$7,$Q86&\" \"&'Components and Space Standards'!$D55&\".\",IF($D$5=$K$8,$S86&\" \"&'Components and Space Standards'!$D55&\".\",)))))","v":0},null,0,{"$f":"IF(OR($D$26<>\"Yes\",$D$26=0,$K$26<>\"Yes\"),,IF($D$5=$K$5,N86,IF($D$5=$K$6,P86,IF($D$5=$K$7,R86,IF($D$5=$K$8,T86,)))))","v":0},null,null,null,null,{"$f":"IF($D86<>0,$D86,IF($D$21=$M$9,Army!$F52,IF($D$21=$M$10,Army!$I52,IF($D$21='Interactive Worksheet'!$M$11,Army!$L52,IF($D$21='Interactive Worksheet'!$M$12,Army!$O52,IF($D$21='Interactive Worksheet'!$M$13,IF($M$17=0,Army!$R52,($M$17*Army!U52)+Army!R52)))))))","v":{"$error":"#N/A"}},{"$f":"IF($D86<>0,$D86*'Components and Space Standards'!$C55,IF($D$21=$M$9,Army!$H52,IF($D$21=$M$10,Army!$K52,IF($D$21='Interactive Worksheet'!$M$11,Army!$N52,IF($D$21='Interactive Worksheet'!$M$12,Army!$Q52,IF($D$21='Interactive Worksheet'!$M$13,IF($M$17=0,Army!$T52,($M$17*Army!W52)+Army!T52)))))))","v":{"$error":"#N/A"}},{"$f":"IF(D86<>0,D86,IF($D$21=$M$9,Navy!F53,IF($D$21=$M$10,Navy!I53,IF($D$21='Interactive Worksheet'!$M$11,Navy!L53,IF($D$21='Interactive Worksheet'!$M$12,Navy!O53,IF($D$21='Interactive Worksheet'!$M$13,Navy!R53,IF($O$18>0,Navy!U53,)))))))","v":{"$error":"#N/A"}},{"$f":"IF(D86<>0,D86*'Components and Space Standards'!C55,IF($D$21=$M$9,Navy!H53,IF($D$21=$M$10,Navy!K53,IF($D$21='Interactive Worksheet'!$M$11,Navy!N53,IF($D$21='Interactive Worksheet'!$M$12,Navy!Q53,IF($D$21='Interactive Worksheet'!$M$13,Navy!T53,IF($O$18>0,Navy!W53,)))))))","v":{"$error":"#N/A"}},{"$f":"IF(D86<>0,D86,IF($D$21=$M$10,AF!F52,IF($D$21=$M$11,AF!I52,IF($D$21='Interactive Worksheet'!$M$12,AF!L52,))))","v":{"$error":"#N/A"}},{"$f":"IF(D86<>0,D86*'Components and Space Standards'!C55,IF($D$21=$M$10,AF!H52,IF($D$21=$M$11,AF!K52,IF($D$21='Interactive Worksheet'!$M$12,AF!N52,))))","v":{"$error":"#N/A"}},{"$f":"IF($D86<>0,$D86,IF($D$21=$M$9,MC!F53,IF($D$21=$M$10,MC!I53,IF($D$21='Interactive Worksheet'!$M$11,MC!L53,IF($D$21='Interactive Worksheet'!$M$12,MC!O53,IF($D$21='Interactive Worksheet'!$M$13,MC!R53,))))))","v":{"$error":"#N/A"}},{"$f":"IF($D86<>0,$D86*'Components and Space Standards'!C55,IF($D$21=$M$9,MC!H53,IF($D$21=$M$10,MC!K53,IF($D$21='Interactive Worksheet'!$M$11,MC!N53,IF($D$21='Interactive Worksheet'!$M$12,MC!Q53,IF($D$21='Interactive Worksheet'!$M$13,MC!T53,))))))","v":{"$error":"#N/A"}}]
[{"$f":"IF(OR($D$26<>\"Yes\",$D$26=0,$K$26<>\"Yes\"),,'Components and Space Standards'!A56)","v":0},null,null,null,{"$f":"IF(OR($D$26<>\"Yes\",$D$26=0,$K$26<>\"Yes\"),,IF($D$5=$K$5,$M87&\" \"&'Components and Space Standards'!$D56&\".\",IF($D$5=$K$6,$O87&\" \"&'Components and Space Standards'!$D56&\".\",IF($D$5=$K$7,$Q87&\" \"&'Components and Space Standards'!$D56&\".\",IF($D$5=$K$8,$S87&\" \"&'Components and Space Standards'!$D56&\".\",)))))","v":0},null,0,{"$f":"IF(OR($D$26<>\"Yes\",$D$26=0,$K$26<>\"Yes\"),,IF($D$5=$K$5,N87,IF($D$5=$K$6,P87,IF($D$5=$K$7,R87,IF($D$5=$K$8,T87,)))))","v":0},null,null,null,null,{"$f":"IF($D87<>0,$D87,IF($D$21=$M$9,Army!$F53,IF($D$21=$M$10,Army!$I53,IF($D$21='Interactive Worksheet'!$M$11,Army!$L53,IF($D$21='Interactive Worksheet'!$M$12,Army!$O53,IF($D$21='Interactive Worksheet'!$M$13,IF($M$17=0,Army!$R53,($M$17*Army!U53)+Army!R53)))))))","v":{"$error":"#N/A"}},{"$f":"IF($D87<>0,$D87*'Components and Space Standards'!$C56,IF($D$21=$M$9,Army!$H53,IF($D$21=$M$10,Army!$K53,IF($D$21='Interactive Worksheet'!$M$11,Army!$N53,IF($D$21='Interactive Worksheet'!$M$12,Army!$Q53,IF($D$21='Interactive Worksheet'!$M$13,IF($M$17=0,Army!$T53,($M$17*Army!W53)+Army!T53)))))))","v":{"$error":"#N/A"}},{"$f":"IF(D87<>0,D87,IF($D$21=$M$9,Navy!F54,IF($D$21=$M$10,Navy!I54,IF($D$21='Interactive Worksheet'!$M$11,Navy!L54,IF($D$21='Interactive Worksheet'!$M$12,Navy!O54,IF($D$21='Interactive Worksheet'!$M$13,Navy!R54,IF($O$18>0,Navy!U54,)))))))","v":{"$error":"#N/A"}},{"$f":"IF(D87<>0,D87*'Components and Space Standards'!C56,IF($D$21=$M$9,Navy!H54,IF($D$21=$M$10,Navy!K54,IF($D$21='Interactive Worksheet'!$M$11,Navy!N54,IF($D$21='Interactive Worksheet'!$M$12,Navy!Q54,IF($D$21='Interactive Worksheet'!$M$13,Navy!T54,IF($O$18>0,Navy!W54,)))))))","v":{"$error":"#N/A"}},{"$f":"IF(D87<>0,D87,IF($D$21=$M$10,AF!F53,IF($D$21=$M$11,AF!I53,IF($D$21='Interactive Worksheet'!$M$12,AF!L53,))))","v":{"$error":"#N/A"}},{"$f":"IF(D87<>0,D87*'Components and Space Standards'!C56,IF($D$21=$M$10,AF!H53,IF($D$21=$M$11,AF!K53,IF($D$21='Interactive Worksheet'!$M$12,AF!N53,))))","v":{"$error":"#N/A"}},{"$f":"IF($D87<>0,$D87,IF($D$21=$M$9,MC!F54,IF($D$21=$M$10,MC!I54,IF($D$21='Interactive Worksheet'!$M$11,MC!L54,IF($D$21='Interactive Worksheet'!$M$12,MC!O54,IF($D$21='Interactive Worksheet'!$M$13,MC!R54,))))))","v":{"$error":"#N/A"}},{"$f":"IF($D87<>0,$D87*'Components and Space Standards'!C56,IF($D$21=$M$9,MC!H54,IF($D$21=$M$10,MC!K54,IF($D$21='Interactive Worksheet'!$M$11,MC!N54,IF($D$21='Interactive Worksheet'!$M$12,MC!Q54,IF($D$21='Interactive Worksheet'!$M$13,MC!T54,))))))","v":{"$error":"#N/A"}}]
[{"$f":"IF(OR($D$26<>\"Yes\",$D$26=0,$K$26<>\"Yes\"),,'Components and Space Standards'!A57)","v":0},null,null,null,{"$f":"IF(OR($D$26<>\"Yes\",$D$26=0,$K$26<>\"Yes\"),,IF($D$5=$K$5,$M88&\" \"&'Components and Space Standards'!$D57&\".\",IF($D$5=$K$6,$O88&\" \"&'Components and Space Standards'!$D57&\".\",IF($D$5=$K$7,$Q88&\" \"&'Components and Space Standards'!$D57&\".\",IF($D$5=$K$8,$S88&\" \"&'Components and Space Standards'!$D57&\".\",)))))","v":0},null,0,0,null,null,null,null,{"$f":"IF($D88<>0,$D88,IF($D$21=$M$9,Army!$F54,IF($D$21=$M$10,Army!$I54,IF($D$21='Interactive Worksheet'!$M$11,Army!$L54,IF($D$21='Interactive Worksheet'!$M$12,Army!$O54,IF($D$21='Interactive Worksheet'!$M$13,IF($M$17=0,Army!$R54,($M$17*Army!U54)+Army!R54)))))))","v":{"$error":"#N/A"}},{"$f":"IF($D88<>0,$D88*'Components and Space Standards'!$C57,IF($D$21=$M$9,Army!$H54,IF($D$21=$M$10,Army!$K54,IF($D$21='Interactive Worksheet'!$M$11,Army!$N54,IF($D$21='Interactive Worksheet'!$M$12,Army!$Q54,IF($D$21='Interactive Worksheet'!$M$13,IF($M$17=0,Army!$T54,($M$17*Army!W54)+Army!T54)))))))","v":{"$error":"#N/A"}},{"$f":"IF(D88<>0,D88,IF($D$21=$M$9,Navy!F55,IF($D$21=$M$10,Navy!I55,IF($D$21='Interactive Worksheet'!$M$11,Navy!L55,IF($D$21='Interactive Worksheet'!$M$12,Navy!O55,IF($D$21='Interactive Worksheet'!$M$13,Navy!R55,IF($O$18>0,Navy!U55,)))))))","v":{"$error":"#N/A"}},{"$f":"IF(D88<>0,D88*'Components and Space Standards'!C57,IF($D$21=$M$9,Navy!H55,IF($D$21=$M$10,Navy!K55,IF($D$21='Interactive Worksheet'!$M$11,Navy!N55,IF($D$21='Interactive Worksheet'!$M$12,Navy!Q55,IF($D$21='Interactive Worksheet'!$M$13,Navy!T55,IF($O$18>0,Navy!W55,)))))))","v":{"$error":"#N/A"}},{"$f":"IF(D88<>0,D88,IF($D$21=$M$10,AF!F54,IF($D$21=$M$11,AF!I54,IF($D$21='Interactive Worksheet'!$M$12,AF!L54,))))","v":{"$error":"#N/A"}},{"$f":"IF(D88<>0,D88*'Components and Space Standards'!C57,IF($D$21=$M$10,AF!H54,IF($D$21=$M$11,AF!K54,IF($D$21='Interactive Worksheet'!$M$12,AF!N54,))))","v":{"$error":"#N/A"}},{"$f":"IF($D88<>0,$D88,IF($D$21=$M$9,MC!F55,IF($D$21=$M$10,MC!I55,IF($D$21='Interactive Worksheet'!$M$11,MC!L55,IF($D$21='Interactive Worksheet'!$M$12,MC!O55,IF($D$21='Interactive Worksheet'!$M$13,MC!R55,))))))","v":{"$error":"#N/A"}},{"$f":"IF($D88<>0,$D88*'Components and Space Standards'!C57,IF($D$21=$M$9,MC!H55,IF($D$21=$M$10,MC!K55,IF($D$21='Interactive Worksheet'!$M$11,MC!N55,IF($D$21='Interactive Worksheet'!$M$12,MC!Q55,IF($D$21='Interactive Worksheet'!$M$13,MC!T55,))))))","v":{"$error":"#N/A"}}]
[{"$f":"IF(OR($D$26<>\"Yes\",$D$26=0,$K$26<>\"Yes\"),,'Components and Space Standards'!A58)","v":0},null,{"$f":"IF(OR($D$26<>\"Yes\",$D$26=0,$K$26<>\"Yes\"),,IF(D5=K8,\"For this option, enter # of workstations\",))","v":0},null,{"$f":"IF(OR($D$26<>\"Yes\",$D$26=0,$K$26<>\"Yes\"),,IF($D$5=$K$5,$M89&\" \"&'Components and Space Standards'!$D58&\".\",IF($D$5=$K$6,$O89&\" \"&'Components and Space Standards'!$D58&\".\",IF($D$5=$K$7,$Q89&\" \"&'Components and Space Standards'!$D58&\".\",IF($D$5=$K$8,$S89&\" \"&'Components and Space Standards'!$D58&\".\",)))))","v":0},null,0,0,null,null,null,null,{"$f":"IF($D89<>0,$D89,IF($D$21=$M$9,Army!$F55,IF($D$21=$M$10,Army!$I55,IF($D$21='Interactive Worksheet'!$M$11,Army!$L55,IF($D$21='Interactive Worksheet'!$M$12,Army!$O55,IF($D$21='Interactive Worksheet'!$M$13,IF($M$17=0,Army!$R55,($M$17*Army!U55)+Army!R55)))))))","v":{"$error":"#N/A"}},{"$f":"IF($D89<>0,$D89*'Components and Space Standards'!$C58,IF($D$21=$M$9,Army!$H55,IF($D$21=$M$10,Army!$K55,IF($D$21='Interactive Worksheet'!$M$11,Army!$N55,IF($D$21='Interactive Worksheet'!$M$12,Army!$Q55,IF($D$21='Interactive Worksheet'!$M$13,IF($M$17=0,Army!$T55,($M$17*Army!W55)+Army!T55)))))))","v":{"$error":"#N/A"}},{"$f":"IF($D89=$K$26,1,0)","v":0},null,{"$f":"IF(D89<>0,D89,IF($D$21=$M$10,AF!F55,IF($D$21=$M$11,AF!I55,IF($D$21='Interactive Worksheet'!$M$12,AF!L55,))))","v":{"$error":"#N/A"}},{"$f":"IF(D89<>0,D89*'Components and Space Standards'!C58,IF($D$21=$M$10,AF!H55,IF($D$21=$M$11,AF!K55,IF($D$21='Interactive Worksheet'!$M$12,AF!N55,))))","v":{"$error":"#N/A"}},{"$f":"D89","v":0},{"$f":"S89*'Components and Space Standards'!C68","v":0}]
[{"$f":"IF(OR($D$26<>\"Yes\",$D$26=0,$K$26<>\"Yes\"),,'Components and Space Standards'!A59)","v":0},null,null,null,{"$f":"IF(OR($D$26<>\"Yes\",$D$26=0,$K$26<>\"Yes\"),,IF($D$5=$K$5,$M90&\" \"&'Components and Space Standards'!$D59&\".\",IF($D$5=$K$6,$O90&\" \"&'Components and Space Standards'!$D59&\".\",IF($D$5=$K$7,$Q90&\" \"&'Components and Space Standards'!$D59&\".\",IF($D$5=$K$8,$S90&\" \"&'Components and Space Standards'!$D59&\".\",)))))","v":0},null,0,0,null,null,null,null,{"$f":"IF($D90<>0,$D90,IF($D$21=$M$9,Army!$F56,IF($D$21=$M$10,Army!$I56,IF($D$21='Interactive Worksheet'!$M$11,Army!$L56,IF($D$21='Interactive Worksheet'!$M$12,Army!$O56,IF($D$21='Interactive Worksheet'!$M$13,IF($M$17=0,Army!$R56,($M$17*Army!U56)+Army!R56)))))))","v":{"$error":"#N/A"}},{"$f":"IF($D90<>0,$D90*'Components and Space Standards'!$C59,IF($D$21=$M$9,Army!$H56,IF($D$21=$M$10,Army!$K56,IF($D$21='Interactive Worksheet'!$M$11,Army!$N56,IF($D$21='Interactive Worksheet'!$M$12,Army!$Q56,IF($D$21='Interactive Worksheet'!$M$13,IF($M$17=0,Army!$T56,($M$17*Army!W56)+Army!T56)))))))","v":{"$error":"#N/A"}},{"$f":"IF(D90<>0,D90,IF($D$21=$M$9,Navy!F57,IF($D$21=$M$10,Navy!I57,IF($D$21='Interactive Worksheet'!$M$11,Navy!L57,IF($D$21='Interactive Worksheet'!$M$12,Navy!O57,IF($D$21='Interactive Worksheet'!$M$13,Navy!R57,IF($O$18>0,Navy!U57,)))))))","v":{"$error":"#N/A"}},{"$f":"IF(D90<>0,D90*'Components and Space Standards'!C59,IF($D$21=$M$9,Navy!H57,IF($D$21=$M$10,Navy!K57,IF($D$21='Interactive Worksheet'!$M$11,Navy!N57,IF($D$21='Interactive Worksheet'!$M$12,Navy!Q57,IF($D$21='Interactive Worksheet'!$M$13,Navy!T57,IF($O$18>0,Navy!W57,)))))))","v":{"$error":"#N/A"}},{"$f":"IF(D90<>0,D90,IF($D$21=$M$10,AF!F56,IF($D$21=$M$11,AF!I56,IF($D$21='Interactive Worksheet'!$M$12,AF!L56,))))","v":{"$error":"#N/A"}},{"$f":"IF(D90<>0,D90*'Components and Space Standards'!C59,IF($D$21=$M$10,AF!H56,IF($D$21=$M$11,AF!K56,IF($D$21='Interactive Worksheet'!$M$12,AF!N56,))))","v":{"$error":"#N/A"}},{"$f":"IF($D90<>0,$D90,IF($D$21=$M$9,MC!F57,IF($D$21=$M$10,MC!I57,IF($D$21='Interactive Worksheet'!$M$11,MC!L57,IF($D$21='Interactive Worksheet'!$M$12,MC!O57,IF($D$21='Interactive Worksheet'!$M$13,MC!R57,))))))","v":{"$error":"#N/A"}},{"$f":"IF($D90<>0,$D90*'Components and Space Standards'!C59,IF($D$21=$M$9,MC!H57,IF($D$21=$M$10,MC!K57,IF($D$21='Interactive Worksheet'!$M$11,MC!N57,IF($D$21='Interactive Worksheet'!$M$12,MC!Q57,IF($D$21='Interactive Worksheet'!$M$13,MC!T57,))))))","v":{"$error":"#N/A"}}]
[{"$f":"IF(OR($D$26<>\"Yes\",$D$26=0,$K$26<>\"Yes\"),,'Components and Space Standards'!A60)","v":0},null,null,null,{"$f":"IF(OR($D$26<>\"Yes\",$D$26=0,$K$26<>\"Yes\"),,IF($D$5=$K$5,$M91&\" \"&'Components and Space Standards'!$D60&\".\",IF($D$5=$K$6,$O91&\" \"&'Components and Space Standards'!$D60&\".\",IF($D$5=$K$7,$Q91&\" \"&'Components and Space Standards'!$D60&\".\",IF($D$5=$K$8,$S91&\" \"&'Components and Space Standards'!$D60&\".\",)))))","v":0},null,0,0,null,null,null,null,{"$f":"IF($D91<>0,$D91,IF($D$21=$M$9,Army!$F57,IF($D$21=$M$10,Army!$I57,IF($D$21='Interactive Worksheet'!$M$11,Army!$L57,IF($D$21='Interactive Worksheet'!$M$12,Army!$O57,IF($D$21='Interactive Worksheet'!$M$13,IF($M$17=0,Army!$R57,($M$17*Army!U57)+Army!R57)))))))","v":{"$error":"#N/A"}},{"$f":"IF($D91<>0,$D91*'Components and Space Standards'!$C60,IF($D$21=$M$9,Army!$H57,IF($D$21=$M$10,Army!$K57,IF($D$21='Interactive Worksheet'!$M$11,Army!$N57,IF($D$21='Interactive Worksheet'!$M$12,Army!$Q57,IF($D$21='Interactive Worksheet'!$M$13,IF($M$17=0,Army!$T57,($M$17*Army!W57)+Army!T57)))))))","v":{"$error":"#N/A"}},{"$f":"IF(D91<>0,D91,IF($D$21=$M$9,Navy!F58,IF($D$21=$M$10,Navy!I58,IF($D$21='Interactive Worksheet'!$M$11,Navy!L58,IF($D$21='Interactive Worksheet'!$M$12,Navy!O58,IF($D$21='Interactive Worksheet'!$M$13,Navy!R58,IF($O$18>0,Navy!U58,)))))))","v":{"$error":"#N/A"}},{"$f":"IF(D91<>0,D91*'Components and Space Standards'!C60,IF($D$21=$M$9,Navy!H58,IF($D$21=$M$10,Navy!K58,IF($D$21='Interactive Worksheet'!$M$11,Navy!N58,IF($D$21='Interactive Worksheet'!$M$12,Navy!Q58,IF($D$21='Interactive Worksheet'!$M$13,Navy!T58,IF($O$18>0,Navy!W58,)))))))","v":{"$error":"#N/A"}},{"$f":"IF(D91<>0,D91,IF($D$21=$M$10,AF!F57,IF($D$21=$M$11,AF!I57,IF($D$21='Interactive Worksheet'!$M$12,AF!L57,))))","v":{"$error":"#N/A"}},{"$f":"IF(D91<>0,D91*'Components and Space Standards'!C60,IF($D$21=$M$10,AF!H57,IF($D$21=$M$11,AF!K57,IF($D$21='Interactive Worksheet'!$M$12,AF!N57,))))","v":{"$error":"#N/A"}},{"$f":"IF($D91<>0,$D91,IF($D$21=$M$9,MC!F58,IF($D$21=$M$10,MC!I58,IF($D$21='Interactive Worksheet'!$M$11,MC!L58,IF($D$21='Interactive Worksheet'!$M$12,MC!O58,IF($D$21='Interactive Worksheet'!$M$13,MC!R58,))))))","v":{"$error":"#N/A"}},{"$f":"IF($D91<>0,$D91*'Components and Space Standards'!C60,IF($D$21=$M$9,MC!H58,IF($D$21=$M$10,MC!K58,IF($D$21='Interactive Worksheet'!$M$11,MC!N58,IF($D$21='Interactive Worksheet'!$M$12,MC!Q58,IF($D$21='Interactive Worksheet'!$M$13,MC!T58,))))))","v":{"$error":"#N/A"}}]
[{"$f":"IF(OR($D$26<>\"Yes\",$D$26=0,$K$26<>\"Yes\"),,'Components and Space Standards'!A61)","v":0},null,null,null,{"$f":"IF(OR($D$26<>\"Yes\",$D$26=0,$K$26<>\"Yes\"),,IF($D$5=$K$5,$M92&\" \"&'Components and Space Standards'!$D61&\".\",IF($D$5=$K$6,$O92&\" \"&'Components and Space Standards'!$D61&\".\",IF($D$5=$K$7,$Q92&\" \"&'Components and Space Standards'!$D61&\".\",IF($D$5=$K$8,$S92&\" \"&'Components and Space Standards'!$D61&\".\",)))))","v":0},null,0,0,null,null,null,null,{"$f":"IF($D92<>0,$D92,IF($D$21=$M$9,Army!$F58,IF($D$21=$M$10,Army!$I58,IF($D$21='Interactive Worksheet'!$M$11,Army!$L58,IF($D$21='Interactive Worksheet'!$M$12,Army!$O58,IF($D$21='Interactive Worksheet'!$M$13,IF($M$17=0,Army!$R58,($M$17*Army!U58)+Army!R58)))))))","v":{"$error":"#N/A"}},{"$f":"IF($D92<>0,$D92*'Components and Space Standards'!$C61,IF($D$21=$M$9,Army!$H58,IF($D$21=$M$10,Army!$K58,IF($D$21='Interactive Worksheet'!$M$11,Army!$N58,IF($D$21='Interactive Worksheet'!$M$12,Army!$Q58,IF($D$21='Interactive Worksheet'!$M$13,IF($M$17=0,Army!$T58,($M$17*Army!W58)+Army!T58)))))))","v":{"$error":"#N/A"}},{"$f":"IF(D92<>0,D92,IF($D$21=$M$9,Navy!F59,IF($D$21=$M$10,Navy!I59,IF($D$21='Interactive Worksheet'!$M$11,Navy!L59,IF($D$21='Interactive Worksheet'!$M$12,Navy!O59,IF($D$21='Interactive Worksheet'!$M$13,Navy!R59,IF($O$18>0,Navy!U59,)))))))","v":{"$error":"#N/A"}},{"$f":"IF(D92<>0,D92*'Components and Space Standards'!C61,IF($D$21=$M$9,Navy!H59,IF($D$21=$M$10,Navy!K59,IF($D$21='Interactive Worksheet'!$M$11,Navy!N59,IF($D$21='Interactive Worksheet'!$M$12,Navy!Q59,IF($D$21='Interactive Worksheet'!$M$13,Navy!T59,IF($O$18>0,Navy!W59,)))))))","v":{"$error":"#N/A"}},{"$f":"IF(D92<>0,D92,IF($D$21=$M$10,AF!F58,IF($D$21=$M$11,AF!I58,IF($D$21='Interactive Worksheet'!$M$12,AF!L58,))))","v":{"$error":"#N/A"}},{"$f":"IF(D92<>0,D92*'Components and Space Standards'!C61,IF($D$21=$M$10,AF!H58,IF($D$21=$M$11,AF!K58,IF($D$21='Interactive Worksheet'!$M$12,AF!N58,))))","v":{"$error":"#N/A"}},{"$f":"IF($D92<>0,$D92,IF($D$21=$M$9,MC!F59,IF($D$21=$M$10,MC!I59,IF($D$21='Interactive Worksheet'!$M$11,MC!L59,IF($D$21='Interactive Worksheet'!$M$12,MC!O59,IF($D$21='Interactive Worksheet'!$M$13,MC!R59,))))))","v":{"$error":"#N/A"}},{"$f":"IF($D92<>0,$D92*'Components and Space Standards'!C61,IF($D$21=$M$9,MC!H59,IF($D$21=$M$10,MC!K59,IF($D$21='Interactive Worksheet'!$M$11,MC!N59,IF($D$21='Interactive Worksheet'!$M$12,MC!Q59,IF($D$21='Interactive Worksheet'!$M$13,MC!T59,))))))","v":{"$error":"#N/A"}}]
[]
[{"$f":"IF(OR($D$26<>\"Yes\",$D$26=0,$K$26<>\"Yes\"),,'Components and Space Standards'!A65)","v":0},null,null,null,null,null,null,null,null,null,null,null,null,null,{"$f":"IF(D94<>0,D94,IF($D$21=$M$9,Navy!F62,IF($D$21=$M$10,Navy!I62,IF($D$21='Interactive Worksheet'!$M$11,Navy!L62,IF($D$21='Interactive Worksheet'!$M$12,Navy!O62,IF($D$21='Interactive Worksheet'!$M$13,Navy!R62,))))))","v":{"$error":"#N/A"}},{"$f":"IF(D94<>0,D94*'Components and Space Standards'!C65,IF($D$21=$M$9,Navy!H62,IF($D$21=$M$10,Navy!K62,IF($D$21='Interactive Worksheet'!$M$11,Navy!N62,IF($D$21='Interactive Worksheet'!$M$12,Navy!Q62,IF($D$21='Interactive Worksheet'!$M$13,Navy!T62,))))))","v":{"$error":"#N/A"}},{"$f":"IF(D94<>0,D94,IF($D$21=$M$10,AF!F61,IF($D$21=$M$11,AF!I61,IF($D$21='Interactive Worksheet'!$M$12,AF!L61,))))","v":{"$error":"#N/A"}},{"$f":"IF(D94<>0,D94*'Components and Space Standards'!C65,IF($D$21=$M$10,AF!H61,IF($D$21=$M$11,AF!K61,IF($D$21='Interactive Worksheet'!$M$12,AF!N61,))))","v":{"$error":"#N/A"}},{"$f":"IF($D94<>0,$D94,IF($D$21=$M$9,MC!F62,IF($D$21=$M$10,MC!I62,IF($D$21='Interactive Worksheet'!$M$11,MC!L62,IF($D$21='Interactive Worksheet'!$M$12,MC!O62,IF($D$21='Interactive Worksheet'!$M$13,MC!R62,))))))","v":{"$error":"#N/A"}},{"$f":"IF($D94<>0,$D94*'Components and Space Standards'!C65,IF($D$21=$M$9,MC!H62,IF($D$21=$M$10,MC!K62,IF($D$21='Interactive Worksheet'!$M$11,MC!N62,IF($D$21='Interactive Worksheet'!$M$12,MC!Q62,IF($D$21='Interactive Worksheet'!$M$13,MC!T62,))))))","v":{"$error":"#N/A"}}]
[{"$f":"IF(OR($D$26<>\"Yes\",$D$26=0,$K$26<>\"Yes\"),,'Components and Space Standards'!A66)","v":0},null,null,null,{"$f":"IF(OR($D$26<>\"Yes\",$D$26=0,$K$26<>\"Yes\"),,IF($D$5=$K$5,$M95&\" \"&'Components and Space Standards'!$D66&\".\",IF($D$5=$K$6,$O95&\" \"&'Components and Space Standards'!$D66&\".\",IF($D$5=$K$7,$Q95&\" \"&'Components and Space Standards'!$D66&\".\",IF($D$5=$K$8,$S95&\" \"&'Components and Space Standards'!$D66&\".\",)))))","v":0},null,0,{"$f":"IF(OR($D$26<>\"Yes\",$D$26=0,$K$26<>\"Yes\"),,IF($D$5=$K$5,N95,IF($D$5=$K$6,P95,IF($D$5=$K$7,R95,IF($D$5=$K$8,T95,)))))","v":0},null,null,null,null,{"$f":"IF($D95<>0,$D95,IF($D$21=$M$9,Army!$F62,IF($D$21=$M$10,Army!$I62,IF($D$21='Interactive Worksheet'!$M$11,Army!$L62,IF($D$21='Interactive Worksheet'!$M$12,Army!$O62,IF($D$21='Interactive Worksheet'!$M$13,IF($M$17=0,Army!$R62,($M$17*Army!U62)+Army!R62)))))))","v":{"$error":"#N/A"}},{"$f":"IF($D95<>0,$D95*'Components and Space Standards'!$C66,IF($D$21=$M$9,Army!$H62,IF($D$21=$M$10,Army!$K62,IF($D$21='Interactive Worksheet'!$M$11,Army!$N62,IF($D$21='Interactive Worksheet'!$M$12,Army!$Q62,IF($D$21='Interactive Worksheet'!$M$13,IF($M$17=0,Army!$T62,($M$17*Army!W62)+Army!T62)))))))","v":{"$error":"#N/A"}},{"$f":"IF(D95<>0,D95,IF($D$21=$M$9,Navy!F63,IF($D$21=$M$10,Navy!I63,IF($D$21='Interactive Worksheet'!$M$11,Navy!L63,IF($D$21='Interactive Worksheet'!$M$12,Navy!O63,IF($D$21='Interactive Worksheet'!$M$13,Navy!R63,IF($O$18>0,Navy!U63,)))))))","v":{"$error":"#N/A"}},{"$f":"IF(D95<>0,D95*'Components and Space Standards'!C66,IF($D$21=$M$9,Navy!H63,IF($D$21=$M$10,Navy!K63,IF($D$21='Interactive Worksheet'!$M$11,Navy!N63,IF($D$21='Interactive Worksheet'!$M$12,Navy!Q63,IF($D$21='Interactive Worksheet'!$M$13,Navy!T63,IF($O$18>0,Navy!W63,)))))))","v":{"$error":"#N/A"}},{"$f":"IF(D95<>0,D95,IF($D$21=$M$10,AF!F62,IF($D$21=$M$11,AF!I62,IF($D$21='Interactive Worksheet'!$M$12,AF!L62,))))","v":{"$error":"#N/A"}},{"$f":"IF(D95<>0,D95*'Components and Space Standards'!C66,IF($D$21=$M$10,AF!H62,IF($D$21=$M$11,AF!K62,IF($D$21='Interactive Worksheet'!$M$12,AF!N62,))))","v":{"$error":"#N/A"}},{"$f":"IF($D95<>0,$D95,IF($D$21=$M$9,MC!F63,IF($D$21=$M$10,MC!I63,IF($D$21='Interactive Worksheet'!$M$11,MC!L63,IF($D$21='Interactive Worksheet'!$M$12,MC!O63,IF($D$21='Interactive Worksheet'!$M$13,MC!R63,))))))","v":{"$error":"#N/A"}},{"$f":"IF($D95<>0,$D95*'Components and Space Standards'!C66,IF($D$21=$M$9,MC!H63,IF($D$21=$M$10,MC!K63,IF($D$21='Interactive Worksheet'!$M$11,MC!N63,IF($D$21='Interactive Worksheet'!$M$12,MC!Q63,IF($D$21='Interactive Worksheet'!$M$13,MC!T63,))))))","v":{"$error":"#N/A"}},{"$f":"(H95/120)*1","v":0}]
[{"$f":"IF(OR($D$26<>\"Yes\",$D$26=0,$K$26<>\"Yes\"),,'Components and Space Standards'!A67)","v":0},null,null,null,{"$f":"IF(OR($D$26<>\"Yes\",$D$26=0,$K$26<>\"Yes\"),,IF($D$5=$K$5,$M96&\" \"&'Components and Space Standards'!$D67&\".\",IF($D$5=$K$6,$O96&\" \"&'Components and Space Standards'!$D67&\".\",IF($D$5=$K$7,$Q96&\" \"&'Components and Space Standards'!$D67&\".\",IF($D$5=$K$8,$S96&\" \"&'Components and Space Standards'!$D67&\".\",)))))","v":0},null,0,0,null,null,null,null,{"$f":"IF($D96<>0,$D96,IF($D$21=$M$9,Army!$F63,IF($D$21=$M$10,Army!$I63,IF($D$21='Interactive Worksheet'!$M$11,Army!$L63,IF($D$21='Interactive Worksheet'!$M$12,Army!$O63,IF($D$21='Interactive Worksheet'!$M$13,IF($M$17=0,Army!$R63,($M$17*Army!U63)+Army!R63)))))))","v":{"$error":"#N/A"}},{"$f":"IF($D96<>0,$D96*'Components and Space Standards'!$C67,IF($D$21=$M$9,Army!$H63,IF($D$21=$M$10,Army!$K63,IF($D$21='Interactive Worksheet'!$M$11,Army!$N63,IF($D$21='Interactive Worksheet'!$M$12,Army!$Q63,IF($D$21='Interactive Worksheet'!$M$13,IF($M$17=0,Army!$T63,($M$17*Army!W63)+Army!T63)))))))","v":{"$error":"#N/A"}},{"$f":"IF(D96<>0,D96,IF($D$21=$M$9,Navy!F64,IF($D$21=$M$10,Navy!I64,IF($D$21='Interactive Worksheet'!$M$11,Navy!L64,IF($D$21='Interactive Worksheet'!$M$12,Navy!O64,IF($D$21='Interactive Worksheet'!$M$13,Navy!R64,IF($O$18>0,Navy!U64,)))))))","v":{"$error":"#N/A"}},{"$f":"IF(D96<>0,D96*'Components and Space Standards'!C67,IF($D$21=$M$9,Navy!H64,IF($D$21=$M$10,Navy!K64,IF($D$21='Interactive Worksheet'!$M$11,Navy!N64,IF($D$21='Interactive Worksheet'!$M$12,Navy!Q64,IF($D$21='Interactive Worksheet'!$M$13,Navy!T64,IF($O$18>0,Navy!W64,)))))))","v":{"$error":"#N/A"}},{"$f":"IF(D96<>0,D96,IF($D$21=$M$10,AF!F63,IF($D$21=$M$11,AF!I63,IF($D$21='Interactive Worksheet'!$M$12,AF!L63,))))","v":{"$error":"#N/A"}},{"$f":"IF(D96<>0,D96*'Components and Space Standards'!C67,IF($D$21=$M$10,AF!H63,IF($D$21=$M$11,AF!K63,IF($D$21='Interactive Worksheet'!$M$12,AF!N63,))))","v":{"$error":"#N/A"}},{"$f":"IF($D96<>0,$D96,IF($D$21=$M$9,MC!F64,IF($D$21=$M$10,MC!I64,IF($D$21='Interactive Worksheet'!$M$11,MC!L64,IF($D$21='Interactive Worksheet'!$M$12,MC!O64,IF($D$21='Interactive Worksheet'!$M$13,MC!R64,))))))","v":{"$error":"#N/A"}},{"$f":"IF($D96<>0,$D96*'Components and Space Standards'!C67,IF($D$21=$M$9,MC!H64,IF($D$21=$M$10,MC!K64,IF($D$21='Interactive Worksheet'!$M$11,MC!N64,IF($D$21='Interactive Worksheet'!$M$12,MC!Q64,IF($D$21='Interactive Worksheet'!$M$13,MC!T64,))))))","v":{"$error":"#N/A"}},{"$f":"(H96/100)*1","v":0}]
[{"$f":"IF(OR($D$26<>\"Yes\",$D$26=0,$K$26<>\"Yes\"),,'Components and Space Standards'!A68)","v":0},null,null,null,{"$f":"IF(OR($D$26<>\"Yes\",$D$26=0,$K$26<>\"Yes\"),,IF($D$5=$K$5,$M97&\" \"&'Components and Space Standards'!$D68&\".\",IF($D$5=$K$6,$O97&\" \"&'Components and Space Standards'!$D68&\".\",IF($D$5=$K$7,$Q97&\" \"&'Components and Space Standards'!$D68&\".\",IF($D$5=$K$8,$S97&\" \"&'Components and Space Standards'!$D68&\".\",)))))","v":0},null,0,0,null,null,null,null,{"$f":"IF($D97<>0,$D97,IF($D$21=$M$9,Army!$F64,IF($D$21=$M$10,Army!$I64,IF($D$21='Interactive Worksheet'!$M$11,Army!$L64,IF($D$21='Interactive Worksheet'!$M$12,Army!$O64,IF($D$21='Interactive Worksheet'!$M$13,IF($M$17=0,Army!$R64,($M$17*Army!U64)+Army!R64)))))))","v":{"$error":"#N/A"}},{"$f":"IF($D97<>0,$D97*'Components and Space Standards'!$C68,IF($D$21=$M$9,Army!$H64,IF($D$21=$M$10,Army!$K64,IF($D$21='Interactive Worksheet'!$M$11,Army!$N64,IF($D$21='Interactive Worksheet'!$M$12,Army!$Q64,IF($D$21='Interactive Worksheet'!$M$13,IF($M$17=0,Army!$T64,($M$17*Army!W64)+Army!T64)))))))","v":{"$error":"#N/A"}},{"$f":"IF(D97<>0,D97,IF($D$21=$M$9,Navy!F65,IF($D$21=$M$10,Navy!I65,IF($D$21='Interactive Worksheet'!$M$11,Navy!L65,IF($D$21='Interactive Worksheet'!$M$12,Navy!O65,IF($D$21='Interactive Worksheet'!$M$13,Navy!R65,IF($O$18>0,Navy!U65,)))))))","v":{"$error":"#N/A"}},{"$f":"IF(D97<>0,D97*'Components and Space Standards'!C68,IF($D$21=$M$9,Navy!H65,IF($D$21=$M$10,Navy!K65,IF($D$21='Interactive Worksheet'!$M$11,Navy!N65,IF($D$21='Interactive Worksheet'!$M$12,Navy!Q65,IF($D$21='Interactive Worksheet'!$M$13,Navy!T65,IF($O$18>0,Navy!W65,)))))))","v":{"$error":"#N/A"}},{"$f":"IF(D97<>0,D97,IF($D$21=$M$10,AF!F64,IF($D$21=$M$11,AF!I64,IF($D$21='Interactive Worksheet'!$M$12,AF!L64,))))","v":{"$error":"#N/A"}},{"$f":"IF(D97<>0,D97*'Components and Space Standards'!C68,IF($D$21=$M$10,AF!H64,IF($D$21=$M$11,AF!K64,IF($D$21='Interactive Worksheet'!$M$12,AF!N64,))))","v":{"$error":"#N/A"}},{"$f":"IF($D97<>0,$D97,IF($D$21=$M$9,MC!F65,IF($D$21=$M$10,MC!I65,IF($D$21='Interactive Worksheet'!$M$11,MC!L65,IF($D$21='Interactive Worksheet'!$M$12,MC!O65,IF($D$21='Interactive Worksheet'!$M$13,MC!R65,))))))","v":{"$error":"#N/A"}},{"$f":"IF($D97<>0,$D97*'Components and Space Standards'!C68,IF($D$21=$M$9,MC!H65,IF($D$21=$M$10,MC!K65,IF($D$21='Interactive Worksheet'!$M$11,MC!N65,IF($D$21='Interactive Worksheet'!$M$12,MC!Q65,IF($D$21='Interactive Worksheet'!$M$13,MC!T65,))))))","v":{"$error":"#N/A"}},{"$f":"(H97/64)*1","v":0}]
[{"$f":"IF(OR($D$26<>\"Yes\",$D$26=0,$K$26<>\"Yes\"),,'Components and Space Standards'!A69)","v":0},null,null,null,{"$f":"IF(OR($D$26<>\"Yes\",$D$26=0,$K$26<>\"Yes\"),,IF($D$5=$K$5,$M98&\" \"&'Components and Space Standards'!$D69&\".\",IF($D$5=$K$6,$O98&\" \"&'Components and Space Standards'!$D69&\".\",IF($D$5=$K$7,$Q98&\" \"&'Components and Space Standards'!$D69&\".\",IF($D$5=$K$8,$S98&\" \"&'Components and Space Standards'!$D69&\".\",)))))","v":0},null,0,0,null,null,null,null,{"$f":"IF($D98<>0,$D98,IF($D$21=$M$9,Army!$F65,IF($D$21=$M$10,Army!$I65,IF($D$21='Interactive Worksheet'!$M$11,Army!$L65,IF($D$21='Interactive Worksheet'!$M$12,Army!$O65,IF($D$21='Interactive Worksheet'!$M$13,IF($M$17=0,Army!$R65,($M$17*Army!U65)+Army!R65)))))))","v":{"$error":"#N/A"}},{"$f":"IF($D98<>0,$D98*'Components and Space Standards'!$C69,IF($D$21=$M$9,Army!$H65,IF($D$21=$M$10,Army!$K65,IF($D$21='Interactive Worksheet'!$M$11,Army!$N65,IF($D$21='Interactive Worksheet'!$M$12,Army!$Q65,IF($D$21='Interactive Worksheet'!$M$13,IF($M$17=0,Army!$T65,($M$17*Army!W65)+Army!T65)))))))","v":{"$error":"#N/A"}},{"$f":"IF(D98<>0,D98,IF($D$21=$M$9,Navy!F66,IF($D$21=$M$10,Navy!I66,IF($D$21='Interactive Worksheet'!$M$11,Navy!L66,IF($D$21='Interactive Worksheet'!$M$12,Navy!O66,IF($D$21='Interactive Worksheet'!$M$13,Navy!R66,IF($O$18>0,Navy!U66,)))))))","v":{"$error":"#N/A"}},{"$f":"IF(D98<>0,D98*'Components and Space Standards'!C69,IF($D$21=$M$9,Navy!H66,IF($D$21=$M$10,Navy!K66,IF($D$21='Interactive Worksheet'!$M$11,Navy!N66,IF($D$21='Interactive Worksheet'!$M$12,Navy!Q66,IF($D$21='Interactive Worksheet'!$M$13,Navy!T66,IF($O$18>0,Navy!W66,)))))))","v":{"$error":"#N/A"}},{"$f":"IF(D98<>0,D98,IF($D$21=$M$10,AF!F65,IF($D$21=$M$11,AF!I65,IF($D$21='Interactive Worksheet'!$M$12,AF!L65,))))","v":{"$error":"#N/A"}},{"$f":"IF(D98<>0,D98*'Components and Space Standards'!C69,IF($D$21=$M$10,AF!H65,IF($D$21=$M$11,AF!K65,IF($D$21='Interactive Worksheet'!$M$12,AF!N65,))))","v":{"$error":"#N/A"}},{"$f":"IF($D98<>0,$D98,IF($D$21=$M$9,MC!F66,IF($D$21=$M$10,MC!I66,IF($D$21='Interactive Worksheet'!$M$11,MC!L66,IF($D$21='Interactive Worksheet'!$M$12,MC!O66,IF($D$21='Interactive Worksheet'!$M$13,MC!R66,))))))","v":{"$error":"#N/A"}},{"$f":"IF($D98<>0,$D98*'Components and Space Standards'!C69,IF($D$21=$M$9,MC!H66,IF($D$21=$M$10,MC!K66,IF($D$21='Interactive Worksheet'!$M$11,MC!N66,IF($D$21='Interactive Worksheet'!$M$12,MC!Q66,IF($D$21='Interactive Worksheet'!$M$13,MC!T66,))))))","v":{"$error":"#N/A"}}]
[{"$f":"IF(OR($D$26<>\"Yes\",$D$26=0,$K$26<>\"Yes\"),,'Components and Space Standards'!A70)","v":0},null,null,null,{"$f":"IF(OR($D$26<>\"Yes\",$D$26=0,$K$26<>\"Yes\"),,IF($D$5=$K$5,$M99&\" \"&'Components and Space Standards'!$D70&\".\",IF($D$5=$K$6,$O99&\" \"&'Components and Space Standards'!$D70&\".\",IF($D$5=$K$7,$Q99&\" \"&'Components and Space Standards'!$D70&\".\",IF($D$5=$K$8,$S99&\" \"&'Components and Space Standards'!$D70&\".\",)))))","v":0},null,0,0,null,null,null,null,{"$f":"IF($D99<>0,$D99,IF($D$21=$M$9,Army!$F66,IF($D$21=$M$10,Army!$I66,IF($D$21='Interactive Worksheet'!$M$11,Army!$L66,IF($D$21='Interactive Worksheet'!$M$12,Army!$O66,IF($D$21='Interactive Worksheet'!$M$13,IF($M$17=0,Army!$R66,($M$17*Army!U66)+Army!R66)))))))","v":{"$error":"#N/A"}},{"$f":"IF($D99<>0,$D99*'Components and Space Standards'!$C70,IF($D$21=$M$9,Army!$H66,IF($D$21=$M$10,Army!$K66,IF($D$21='Interactive Worksheet'!$M$11,Army!$N66,IF($D$21='Interactive Worksheet'!$M$12,Army!$Q66,IF($D$21='Interactive Worksheet'!$M$13,IF($M$17=0,Army!$T66,($M$17*Army!W66)+Army!T66)))))))","v":{"$error":"#N/A"}},{"$f":"IF(D99<>0,D99,IF($D$21=$M$9,Navy!F67,IF($D$21=$M$10,Navy!I67,IF($D$21='Interactive Worksheet'!$M$11,Navy!L67,IF($D$21='Interactive Worksheet'!$M$12,Navy!O67,IF($D$21='Interactive Worksheet'!$M$13,Navy!R67,IF($O$18>0,Navy!U67,)))))))","v":{"$error":"#N/A"}},{"$f":"IF(D99<>0,D99*'Components and Space Standards'!C70,IF($D$21=$M$9,Navy!H67,IF($D$21=$M$10,Navy!K67,IF($D$21='Interactive Worksheet'!$M$11,Navy!N67,IF($D$21='Interactive Worksheet'!$M$12,Navy!Q67,IF($D$21='Interactive Worksheet'!$M$13,Navy!T67,IF($O$18>0,Navy!W67,)))))))","v":{"$error":"#N/A"}},{"$f":"IF(D99<>0,D99,IF($D$21=$M$10,AF!F66,IF($D$21=$M$11,AF!I66,IF($D$21='Interactive Worksheet'!$M$12,AF!L66,))))","v":{"$error":"#N/A"}},{"$f":"IF(D99<>0,D99*'Components and Space Standards'!C70,IF($D$21=$M$10,AF!H66,IF($D$21=$M$11,AF!K66,IF($D$21='Interactive Worksheet'!$M$12,AF!N66,))))","v":{"$error":"#N/A"}},{"$f":"IF($D99<>0,$D99,IF($D$21=$M$9,MC!F67,IF($D$21=$M$10,MC!I67,IF($D$21='Interactive Worksheet'!$M$11,MC!L67,IF($D$21='Interactive Worksheet'!$M$12,MC!O67,IF($D$21='Interactive Worksheet'!$M$13,MC!R67,))))))","v":{"$error":"#N/A"}},{"$f":"IF($D99<>0,$D99*'Components and Space Standards'!C70,IF($D$21=$M$9,MC!H67,IF($D$21=$M$10,MC!K67,IF($D$21='Interactive Worksheet'!$M$11,MC!N67,IF($D$21='Interactive Worksheet'!$M$12,MC!Q67,IF($D$21='Interactive Worksheet'!$M$13,MC!T67,))))))","v":{"$error":"#N/A"}},{"$f":"(H99/420)*15*0.5","v":0}]
[{"$f":"IF(OR($D$26<>\"Yes\",$D$26=0,$K$26<>\"Yes\"),,'Components and Space Standards'!A71)","v":0},null,null,null,{"$f":"IF(OR($D$26<>\"Yes\",$D$26=0,$K$26<>\"Yes\"),,IF($D$5=$K$5,$M100&\" \"&'Components and Space Standards'!$D71&\".\",IF($D$5=$K$6,$O100&\" \"&'Components and Space Standards'!$D71&\".\",IF($D$5=$K$7,$Q100&\" \"&'Components and Space Standards'!$D71&\".\",IF($D$5=$K$8,$S100&\" \"&'Components and Space Standards'!$D71&\".\",)))))","v":0},null,0,0,null,null,null,null,{"$f":"IF($D100<>0,$D100,IF($D$21=$M$9,Army!$F67,IF($D$21=$M$10,Army!$I67,IF($D$21='Interactive Worksheet'!$M$11,Army!$L67,IF($D$21='Interactive Worksheet'!$M$12,Army!$O67,IF($D$21='Interactive Worksheet'!$M$13,IF($M$17=0,Army!$R67,($M$17*Army!U67)+Army!R67)))))))","v":{"$error":"#N/A"}},{"$f":"IF($D100<>0,$D100*'Components and Space Standards'!$C71,IF($D$21=$M$9,Army!$H67,IF($D$21=$M$10,Army!$K67,IF($D$21='Interactive Worksheet'!$M$11,Army!$N67,IF($D$21='Interactive Worksheet'!$M$12,Army!$Q67,IF($D$21='Interactive Worksheet'!$M$13,IF($M$17=0,Army!$T67,($M$17*Army!W67)+Army!T67)))))))","v":{"$error":"#N/A"}},{"$f":"IF(D100<>0,D100,IF($D$21=$M$9,Navy!F68,IF($D$21=$M$10,Navy!I68,IF($D$21='Interactive Worksheet'!$M$11,Navy!L68,IF($D$21='Interactive Worksheet'!$M$12,Navy!O68,IF($D$21='Interactive Worksheet'!$M$13,Navy!R68,IF($O$18>0,Navy!U68,)))))))","v":{"$error":"#N/A"}},{"$f":"IF(D100<>0,D100*'Components and Space Standards'!C71,IF($D$21=$M$9,Navy!H68,IF($D$21=$M$10,Navy!K68,IF($D$21='Interactive Worksheet'!$M$11,Navy!N68,IF($D$21='Interactive Worksheet'!$M$12,Navy!Q68,IF($D$21='Interactive Worksheet'!$M$13,Navy!T68,IF($O$18>0,Navy!W68,)))))))","v":{"$error":"#N/A"}},{"$f":"IF(D100<>0,D100,IF($D$21=$M$10,AF!F67,IF($D$21=$M$11,AF!I67,IF($D$21='Interactive Worksheet'!$M$12,AF!L67,))))","v":{"$error":"#N/A"}},{"$f":"IF(D100<>0,D100*'Components and Space Standards'!C71,IF($D$21=$M$10,AF!H67,IF($D$21=$M$11,AF!K67,IF($D$21='Interactive Worksheet'!$M$12,AF!N67,))))","v":{"$error":"#N/A"}},{"$f":"IF($D100<>0,$D100,IF($D$21=$M$9,MC!F68,IF($D$21=$M$10,MC!I68,IF($D$21='Interactive Worksheet'!$M$11,MC!L68,IF($D$21='Interactive Worksheet'!$M$12,MC!O68,IF($D$21='Interactive Worksheet'!$M$13,MC!R68,))))))","v":{"$error":"#N/A"}},{"$f":"IF($D100<>0,$D100*'Components and Space Standards'!C71,IF($D$21=$M$9,MC!H68,IF($D$21=$M$10,MC!K68,IF($D$21='Interactive Worksheet'!$M$11,MC!N68,IF($D$21='Interactive Worksheet'!$M$12,MC!Q68,IF($D$21='Interactive Worksheet'!$M$13,MC!T68,))))))","v":{"$error":"#N/A"}}]
[]
[{"$f":"IF(OR($D$26<>\"Yes\",$D$26=0,$K$26<>\"Yes\"),,'Components and Space Standards'!A72)","v":0},null,null,null,"Default quantities",null," m2","ft.2",null,null,null,null,null,null,{"$f":"IF(D102<>0,D102,IF($D$21=$M$9,Navy!F69,IF($D$21=$M$10,Navy!I69,IF($D$21='Interactive Worksheet'!$M$11,Navy!L69,IF($D$21='Interactive Worksheet'!$M$12,Navy!O69,IF($D$21='Interactive Worksheet'!$M$13,Navy!R69,))))))","v":{"$error":"#N/A"}},{"$f":"IF(D102<>0,D102*'Components and Space Standards'!C72,IF($D$21=$M$9,Navy!H69,IF($D$21=$M$10,Navy!K69,IF($D$21='Interactive Worksheet'!$M$11,Navy!N69,IF($D$21='Interactive Worksheet'!$M$12,Navy!Q69,IF($D$21='Interactive Worksheet'!$M$13,Navy!T69,))))))","v":{"$error":"#N/A"}},{"$f":"IF(D102<>0,D102,IF($D$21=$M$10,AF!F68,IF($D$21=$M$11,AF!I68,IF($D$21='Interactive Worksheet'!$M$12,AF!L68,))))","v":{"$error":"#N/A"}},{"$f":"IF(D102<>0,D102*'Components and Space Standards'!C72,IF($D$21=$M$10,AF!H68,IF($D$21=$M$11,AF!K68,IF($D$21='Interactive Worksheet'!$M$12,AF!N68,))))","v":{"$error":"#N/A"}},{"$f":"IF($D102<>0,$D102,IF($D$21=$M$9,MC!F69,IF($D$21=$M$10,MC!I69,IF($D$21='Interactive Worksheet'!$M$11,MC!L69,IF($D$21='Interactive Worksheet'!$M$12,MC!O69,IF($D$21='Interactive Worksheet'!$M$13,MC!R69,))))))","v":{"$error":"#N/A"}},{"$f":"IF($D102<>0,$D102*'Components and Space Standards'!C72,IF($D$21=$M$9,MC!H69,IF($D$21=$M$10,MC!K69,IF($D$21='Interactive Worksheet'!$M$11,MC!N69,IF($D$21='Interactive Worksheet'!$M$12,MC!Q69,IF($D$21='Interactive Worksheet'!$M$13,MC!T69,))))))","v":{"$error":"#N/A"}}]
[{"$f":"IF(OR($D$26<>\"Yes\",$D$26=0,$K$26<>\"Yes\"),,'Components and Space Standards'!A75)","v":0}]
[{"$f":"IF(OR($D$26<>\"Yes\",$D$26=0,$K$26<>\"Yes\"),,'Components and Space Standards'!A76)","v":0},null,{"$f":"IF(OR($D$26<>\"Yes\",$D$26=0,$K$26<>\"Yes\"),,\"To change default, select new:\")","v":0},null,{"$f":"IF(OR($D$26<>\"Yes\",$D$26=0,$K$26<>\"Yes\"),,IF(H104='Components and Space Standards'!C77,'Components and Space Standards'!D77,IF(H104='Components and Space Standards'!C77*0.5,'Components and Space Standards'!D77,IF(H104='Components and Space Standards'!C78,'Components and Space Standards'!D78,IF(H104='Components and Space Standards'!C78*0.5,'Components and Space Standards'!D78,IF(H104='Components and Space Standards'!C79,'Components and Space Standards'!D79,IF(H104='Components and Space Standards'!C79*0.5,'Components and Space Standards'!D79,IF(H104='Components and Space Standards'!C80,'Components and Space Standards'!D80,))))))))","v":0},null,{"$f":"ROUND(H104*$K$33,2)","v":0},{"$f":"IF(OR($D$26<>\"Yes\",$D$26=0,$K$26<>\"Yes\"),,IF($D$5=$K$5,N104,IF($D$5=$K$6,P104,IF($D$5=$K$7,R104,IF($D$5=$K$8,T104,)))))","v":0},null,{"$f":"IF(D104<>0,\"D\",)","v":0},"None",null,{"$f":"IF($D$104<>0,\"Error\",IF(SUM(M108:M111)>1,\"Error\",))","v":{"$error":"#N/A"}},{"$f":"IF(M104=\"Error\",M104,SUM(N108:N111))","v":{"$error":"#N/A"}},{"$f":"IF($D$104<>0,\"See D103\",IF(SUM(O108:O111)>1,\"Error\",))","v":{"$error":"#N/A"}},{"$f":"IF($D$104<>0,IF($D$104=$K$104,0,IF($D$104=$K$105,'Components and Space Standards'!$C$77,IF($D$104=$K$106,'Components and Space Standards'!$C$79,IF($D$104=$K$107,'Components and Space Standards'!$C$80,IF(O104=\"Error\",O104,SUM(P108:P111)))))),IF(OR(L11=1,L12=1),'Components and Space Standards'!$C$79,IF(OR(L13=1,G15=1),'Components and Space Standards'!$C$80,)))","v":0},{"$f":"IF($D$104<>0,\"See D103\",IF(SUM(Q108:Q111)>1,\"Error\",))","v":{"$error":"#N/A"}},{"$f":"IF($D$104<>0,IF($D$104=$K$105,'Components and Space Standards'!$C$77,IF('Interactive Worksheet'!$D$104='Interactive Worksheet'!$K$106,'Components and Space Standards'!$C$79,IF('Interactive Worksheet'!$D$104='Interactive Worksheet'!$K$107,'Components and Space Standards'!$C$80,IF(Q104=\"Error\",Q104,SUM(R108:R111))))),IF(Q104=\"Error\",Q104,SUM(R108:R111)))","v":{"$error":"#N/A"}},{"$f":"IF($D$104<>0,\"See D103\",IF(SUM(S108:S111)>1,\"Error\",))","v":{"$error":"#N/A"}},{"$f":"IF($D$104<>0,IF($D$104=$K$105,'Components and Space Standards'!$C$77,IF('Interactive Worksheet'!$D$104='Interactive Worksheet'!$K$106,'Components and Space Standards'!$C$79,IF('Interactive Worksheet'!$D$104='Interactive Worksheet'!$K$107,'Components and Space Standards'!$C$80,IF(S104=\"Error\",S104,SUM(T108:T111))))),IF(S104=\"Error\",S104,SUM(T108:T111)))","v":{"$error":"#N/A"}},{"$f":"IF(H104='Components and Space Standards'!C77*0.5,('Components and Space Standards'!H77/20),IF(H104='Components and Space Standards'!C77,('Components and Space Standards'!H77/20),IF(H104='Components and Space Standards'!C78*0.5,('Components and Space Standards'!H78/20),IF(H104='Components and Space Standards'!C78,('Components and Space Standards'!H78/20),IF(H104='Components and Space Standards'!C79*0.5,('Components and Space Standards'!H79/20),IF(H104='Components and Space Standards'!C79,('Components and Space Standards'!H79/20),IF(H104='Components and Space Standards'!C80*0.5,('Components and Space Standards'!H80/20),IF(H104='Components and Space Standards'!C80,('Components and Space Standards'!H80/20),0))))))))","v":0}]
[null,null,null,null,null,null,null,null,null,null,"1/14-mile, 2-lane"]
[null,null,null,null,null,null,null,null,null,null,"1/11-mile, 3-lane"]
[null,null,null,null,null,null,null,null,null,null,"1/8-mile, 4-lane",null,"Hidden Rows Below - Track defaults"]
[{"$f":"IF(OR($D$26<>\"Yes\",$D$26=0,$K$26<>\"Yes\"),,'Components and Space Standards'!A77)","v":0},null,null,null,null,null,null,null,null,null,null,null,{"$f":"IF($D108<>0,$D108,IF($D$21=$M$9,Army!$F71,IF($D$21=$M$10,Army!$I71,IF($D$21='Interactive Worksheet'!$M$11,Army!$L71,IF($D$21='Interactive Worksheet'!$M$12,Army!$O71,IF($D$21='Interactive Worksheet'!$M$13,Army!$R71,))))))","v":{"$error":"#N/A"}},{"$f":"IF($D108<>0,$D108*'Components and Space Standards'!$C77,IF($D$21=$M$9,Army!$H71,IF($D$21=$M$10,Army!$K71,IF($D$21='Interactive Worksheet'!$M$11,Army!$N71,IF($D$21='Interactive Worksheet'!$M$12,Army!$Q71,IF($D$21='Interactive Worksheet'!$M$13,Army!$T71,))))))","v":{"$error":"#N/A"}},{"$f":"IF(D108<>0,D108,IF($D$21=$M$9,Navy!F72,IF($D$21=$M$10,Navy!I72,IF($D$21='Interactive Worksheet'!$M$11,Navy!L72,IF($D$21='Interactive Worksheet'!$M$12,Navy!O72,IF($D$21='Interactive Worksheet'!$M$13,Navy!R72,IF($O$18>0,Navy!U72,)))))))","v":{"$error":"#N/A"}},{"$f":"IF(D108<>0,D108*'Components and Space Standards'!C77,IF($D$21=$M$9,Navy!H72,IF($D$21=$M$10,Navy!K72,IF($D$21='Interactive Worksheet'!$M$11,Navy!N72,IF($D$21='Interactive Worksheet'!$M$12,Navy!Q72,IF($D$21='Interactive Worksheet'!$M$13,Navy!T72,IF($O$18>0,Navy!W72,)))))))","v":{"$error":"#N/A"}},{"$f":"IF(D108<>0,D108,IF($D$21=$M$10,AF!F71,IF($D$21=$M$11,AF!I71,IF($D$21='Interactive Worksheet'!$M$12,AF!L71,))))","v":{"$error":"#N/A"}},{"$f":"IF(D108<>0,D108*'Components and Space Standards'!C77,IF($D$21=$M$10,AF!H71,IF($D$21=$M$11,AF!K71,IF($D$21='Interactive Worksheet'!$M$12,AF!N71,))))","v":{"$error":"#N/A"}},{"$f":"IF($D108<>0,$D108,IF($D$21=$M$9,MC!F72,IF($D$21=$M$10,MC!I72,IF($D$21='Interactive Worksheet'!$M$11,MC!L72,IF($D$21='Interactive Worksheet'!$M$12,MC!O72,IF($D$21='Interactive Worksheet'!$M$13,MC!R72,))))))","v":{"$error":"#N/A"}},{"$f":"IF($D108<>0,$D108*'Components and Space Standards'!C77,IF($D$21=$M$9,MC!H72,IF($D$21=$M$10,MC!K72,IF($D$21='Interactive Worksheet'!$M$11,MC!N72,IF($D$21='Interactive Worksheet'!$M$12,MC!Q72,IF($D$21='Interactive Worksheet'!$M$13,MC!T72,))))))","v":{"$error":"#N/A"}}]
[{"$f":"IF(OR($D$26<>\"Yes\",$D$26=0,$K$26<>\"Yes\"),,'Components and Space Standards'!A78)","v":0},null,null,null,null,null,null,null,null,null,null,null,{"$f":"IF($D109<>0,$D109,IF($D$21=$M$9,Army!$F72,IF($D$21=$M$10,Army!$I72,IF($D$21='Interactive Worksheet'!$M$11,Army!$L72,IF($D$21='Interactive Worksheet'!$M$12,Army!$O72,IF($D$21='Interactive Worksheet'!$M$13,Army!$R72,))))))","v":{"$error":"#N/A"}},{"$f":"IF($D109<>0,$D109*'Components and Space Standards'!$C78,IF($D$21=$M$9,Army!$H72,IF($D$21=$M$10,Army!$K72,IF($D$21='Interactive Worksheet'!$M$11,Army!$N72,IF($D$21='Interactive Worksheet'!$M$12,Army!$Q72,IF($D$21='Interactive Worksheet'!$M$13,Army!$T72,))))))","v":{"$error":"#N/A"}},{"$f":"IF(D109<>0,D109,IF($D$21=$M$9,Navy!F73,IF($D$21=$M$10,Navy!I73,IF($D$21='Interactive Worksheet'!$M$11,Navy!L73,IF($D$21='Interactive Worksheet'!$M$12,Navy!O73,IF($D$21='Interactive Worksheet'!$M$13,Navy!R73,IF($O$18>0,Navy!U73,)))))))","v":{"$error":"#N/A"}},{"$f":"IF(D109<>0,D109*'Components and Space Standards'!C78,IF($D$21=$M$9,Navy!H73,IF($D$21=$M$10,Navy!K73,IF($D$21='Interactive Worksheet'!$M$11,Navy!N73,IF($D$21='Interactive Worksheet'!$M$12,Navy!Q73,IF($D$21='Interactive Worksheet'!$M$13,Navy!T73,IF($O$18>0,Navy!W73,)))))))","v":{"$error":"#N/A"}},null,null,{"$f":"IF($D109<>0,$D109,IF($D$21=$M$9,MC!F73,IF($D$21=$M$10,MC!I73,IF($D$21='Interactive Worksheet'!$M$11,MC!L73,IF($D$21='Interactive Worksheet'!$M$12,MC!O73,IF($D$21='Interactive Worksheet'!$M$13,MC!R73,))))))","v":{"$error":"#N/A"}},{"$f":"IF($D109<>0,$D109*'Components and Space Standards'!C78,IF($D$21=$M$9,MC!H73,IF($D$21=$M$10,MC!K73,IF($D$21='Interactive Worksheet'!$M$11,MC!N73,IF($D$21='Interactive Worksheet'!$M$12,MC!Q73,IF($D$21='Interactive Worksheet'!$M$13,MC!T73,))))))","v":{"$error":"#N/A"}}]
[{"$f":"IF(OR($D$26<>\"Yes\",$D$26=0,$K$26<>\"Yes\"),,'Components and Space Standards'!A79)","v":0},null,null,null,null,null,null,null,null,null,null,null,{"$f":"IF($D110<>0,$D110,IF($D$21=$M$9,Army!$F73,IF($D$21=$M$10,Army!$I73,IF($D$21='Interactive Worksheet'!$M$11,Army!$L73,IF($D$21='Interactive Worksheet'!$M$12,Army!$O73,IF($D$21='Interactive Worksheet'!$M$13,Army!$R73,))))))","v":{"$error":"#N/A"}},{"$f":"IF($D110<>0,$D110*'Components and Space Standards'!$C79,IF($D$21=$M$9,Army!$H73,IF($D$21=$M$10,Army!$K73,IF($D$21='Interactive Worksheet'!$M$11,Army!$N73,IF($D$21='Interactive Worksheet'!$M$12,Army!$Q73,IF($D$21='Interactive Worksheet'!$M$13,Army!$T73,))))))","v":{"$error":"#N/A"}},{"$f":"IF(D110<>0,D110,IF($D$21=$M$9,Navy!F74,IF($D$21=$M$10,Navy!I74,IF($D$21='Interactive Worksheet'!$M$11,Navy!L74,IF($D$21='Interactive Worksheet'!$M$12,Navy!O74,IF($D$21='Interactive Worksheet'!$M$13,Navy!R74,IF($O$18>0,Navy!U74,)))))))","v":{"$error":"#N/A"}},{"$f":"IF(D110<>0,D110*'Components and Space Standards'!C79,IF($D$21=$M$9,Navy!H74,IF($D$21=$M$10,Navy!K74,IF($D$21='Interactive Worksheet'!$M$11,Navy!N74,IF($D$21='Interactive Worksheet'!$M$12,Navy!Q74,IF($D$21='Interactive Worksheet'!$M$13,Navy!T74,IF($O$18>0,Navy!W74,)))))))","v":{"$error":"#N/A"}},{"$f":"IF(D110<>0,D110,IF($D$21=$M$10,AF!F72,IF($D$21=$M$11,AF!I72,IF($D$21='Interactive Worksheet'!$M$12,AF!L72,))))","v":{"$error":"#N/A"}},{"$f":"IF(D110<>0,D110*'Components and Space Standards'!C79,IF($D$21=$M$10,AF!H72,IF($D$21=$M$11,AF!K72,IF($D$21='Interactive Worksheet'!$M$12,AF!N72,))))","v":{"$error":"#N/A"}},{"$f":"IF($D110<>0,$D110,IF($D$21=$M$9,MC!F74,IF($D$21=$M$10,MC!I74,IF($D$21='Interactive Worksheet'!$M$11,MC!L74,IF($D$21='Interactive Worksheet'!$M$12,MC!O74,IF($D$21='Interactive Worksheet'!$M$13,MC!R74,))))))","v":{"$error":"#N/A"}},{"$f":"IF($D110<>0,$D110*'Components and Space Standards'!C79,IF($D$21=$M$9,MC!H74,IF($D$21=$M$10,MC!K74,IF($D$21='Interactive Worksheet'!$M$11,MC!N74,IF($D$21='Interactive Worksheet'!$M$12,MC!Q74,IF($D$21='Interactive Worksheet'!$M$13,MC!T74,))))))","v":{"$error":"#N/A"}}]
[{"$f":"IF(OR($D$26<>\"Yes\",$D$26=0,$K$26<>\"Yes\"),,'Components and Space Standards'!A80)","v":0},null,null,null,null,null,null,null,null,null,null,null,{"$f":"IF($D111<>0,$D111,IF($D$21=$M$9,Army!$F74,IF($D$21=$M$10,Army!$I74,IF($D$21='Interactive Worksheet'!$M$11,Army!$L74,IF($D$21='Interactive Worksheet'!$M$12,Army!$O74,IF($D$21='Interactive Worksheet'!$M$13,Army!$R74,))))))","v":{"$error":"#N/A"}},{"$f":"IF($D111<>0,$D111*'Components and Space Standards'!$C80,IF($D$21=$M$9,Army!$H74,IF($D$21=$M$10,Army!$K74,IF($D$21='Interactive Worksheet'!$M$11,Army!$N74,IF($D$21='Interactive Worksheet'!$M$12,Army!$Q74,IF($D$21='Interactive Worksheet'!$M$13,Army!$T74,))))))","v":{"$error":"#N/A"}},{"$f":"IF(D111<>0,D111,IF($D$21=$M$9,Navy!F75,IF($D$21=$M$10,Navy!I75,IF($D$21='Interactive Worksheet'!$M$11,Navy!L75,IF($D$21='Interactive Worksheet'!$M$12,Navy!O75,IF($D$21='Interactive Worksheet'!$M$13,Navy!R75,IF($O$18>0,Navy!U75,)))))))","v":{"$error":"#N/A"}},{"$f":"IF(D111<>0,D111*'Components and Space Standards'!C80,IF($D$21=$M$9,Navy!H75,IF($D$21=$M$10,Navy!K75,IF($D$21='Interactive Worksheet'!$M$11,Navy!N75,IF($D$21='Interactive Worksheet'!$M$12,Navy!Q75,IF($D$21='Interactive Worksheet'!$M$13,Navy!T75,IF($O$18>0,Navy!W75,)))))))","v":{"$error":"#N/A"}},{"$f":"IF(D111<>0,D111,IF($D$21=$M$10,AF!F73,IF($D$21=$M$11,AF!I73,IF($D$21='Interactive Worksheet'!$M$12,AF!L73,))))","v":{"$error":"#N/A"}},{"$f":"IF(D111<>0,D111*'Components and Space Standards'!C80,IF($D$21=$M$10,AF!H73,IF($D$21=$M$11,AF!K73,IF($D$21='Interactive Worksheet'!$M$12,AF!N73,))))","v":{"$error":"#N/A"}},{"$f":"IF($D111<>0,$D111,IF($D$21=$M$9,MC!F75,IF($D$21=$M$10,MC!I75,IF($D$21='Interactive Worksheet'!$M$11,MC!L75,IF($D$21='Interactive Worksheet'!$M$12,MC!O75,IF($D$21='Interactive Worksheet'!$M$13,MC!R75,))))))","v":{"$error":"#N/A"}},{"$f":"IF($D111<>0,$D111*'Components and Space Standards'!C80,IF($D$21=$M$9,MC!H75,IF($D$21=$M$10,MC!K75,IF($D$21='Interactive Worksheet'!$M$11,MC!N75,IF($D$21='Interactive Worksheet'!$M$12,MC!Q75,IF($D$21='Interactive Worksheet'!$M$13,MC!T75,))))))","v":{"$error":"#N/A"}}]
[{"$f":"IF(OR($D$26<>\"Yes\",$D$26=0,$K$26<>\"Yes\"),,'Components and Space Standards'!A81)","v":0},null,{"$f":"IF(OR($D$26<>\"Yes\",$D$26=0,$K$26<>\"Yes\"),,\"To change default, enter new quantity:\")","v":0},null,{"$f":"IF(OR($D$26<>\"Yes\",$D$26=0,$K$26<>\"Yes\"),,IF($D$5=$K$5,$M112&\" \"&'Components and Space Standards'!$D81&\".\",IF($D$5=$K$6,$O112&\" \"&'Components and Space Standards'!$D81&\".\",IF($D$5=$K$7,$Q112&\" \"&'Components and Space Standards'!$D81&\".\",IF($D$5=$K$8,$S112&\" \"&'Components and Space Standards'!$D81&\".\",)))))","v":0},null,0,{"$f":"IF(OR($D$26<>\"Yes\",$D$26=0,$K$26<>\"Yes\",$H$104=0,$D$104=\"None\"),,IF($D$5=$K$5,N112,IF($D$5=$K$6,P112,IF($D$5=$K$7,R112,IF($D$5=$K$8,T112,)))))","v":0},null,{"$f":"IF(D112<>0,\"D\",)","v":0},null,null,{"$f":"IF($D112<>0,$D112,IF($D$21=$M$9,Army!$F75,IF($D$21=$M$10,Army!$I75,IF($D$21='Interactive Worksheet'!$M$11,Army!$L75,IF($D$21='Interactive Worksheet'!$M$12,Army!$O75,IF($D$21='Interactive Worksheet'!$M$13,IF($M$17=0,Army!$R75,($M$17*Army!U75)+Army!R75)))))))","v":{"$error":"#N/A"}},{"$f":"IF($D112<>0,$D112*'Components and Space Standards'!$C81,IF($D$21=$M$9,Army!$H75,IF($D$21=$M$10,Army!$K75,IF($D$21='Interactive Worksheet'!$M$11,Army!$N75,IF($D$21='Interactive Worksheet'!$M$12,Army!$Q75,IF($D$21='Interactive Worksheet'!$M$13,IF($M$17=0,Army!$T75,($M$17*Army!W75)+Army!T75)))))))","v":{"$error":"#N/A"}},{"$f":"IF(D104=K104,0,IF(D112<>0,D112,IF($D$21=$M$9,Navy!F76,IF($D$21=$M$10,Navy!I76,IF($D$21='Interactive Worksheet'!$M$11,Navy!L76,IF($D$21='Interactive Worksheet'!$M$12,Navy!O76,IF($D$21='Interactive Worksheet'!$M$13,Navy!R76,IF($O$18>0,Navy!U76,))))))))","v":{"$error":"#N/A"}},{"$f":"IF(D104=K104,0,IF(D112<>0,D112*'Components and Space Standards'!C81,IF($D$21=$M$9,Navy!H76,IF($D$21=$M$10,Navy!K76,IF($D$21='Interactive Worksheet'!$M$11,Navy!N76,IF($D$21='Interactive Worksheet'!$M$12,Navy!Q76,IF($D$21='Interactive Worksheet'!$M$13,Navy!T76,IF($G$15>0,Navy!W76,))))))))","v":{"$error":"#N/A"}},{"$f":"IF(D112<>0,D112,IF($D$21=$M$10,AF!F74,IF($D$21=$M$11,AF!I74,IF($D$21='Interactive Worksheet'!$M$12,AF!L74,))))","v":{"$error":"#N/A"}},{"$f":"IF(D112<>0,D112*'Components and Space Standards'!C81,IF($D$21=$M$10,AF!H74,IF($D$21=$M$11,AF!K74,IF($D$21='Interactive Worksheet'!$M$12,AF!N74,))))","v":{"$error":"#N/A"}},{"$f":"IF($D112<>0,$D112,IF($D$21=$M$9,MC!F76,IF($D$21=$M$10,MC!I76,IF($D$21='Interactive Worksheet'!$M$11,MC!L76,IF($D$21='Interactive Worksheet'!$M$12,MC!O76,IF($D$21='Interactive Worksheet'!$M$13,MC!R76,))))))","v":{"$error":"#N/A"}},{"$f":"IF($D112<>0,$D112*'Components and Space Standards'!C81,IF($D$21=$M$9,MC!H76,IF($D$21=$M$10,MC!K76,IF($D$21='Interactive Worksheet'!$M$11,MC!N76,IF($D$21='Interactive Worksheet'!$M$12,MC!Q76,IF($D$21='Interactive Worksheet'!$M$13,MC!T76,))))))","v":{"$error":"#N/A"}}]
[{"$f":"IF(OR($D$26<>\"Yes\",$D$26=0,$K$26<>\"Yes\"),,'Components and Space Standards'!A82)","v":0},null,{"$f":"IF(OR($D$26<>\"Yes\",$D$26=0,$K$26<>\"Yes\"),,\"For this option, enter required rooms:\")","v":0},null,{"$f":"IF(OR($D$26<>\"Yes\",$D$26=0,$K$26<>\"Yes\"),,IF($D$5=$K$5,$M113&\" \"&'Components and Space Standards'!$D82&\".\",IF($D$5=$K$6,$O113&\" \"&'Components and Space Standards'!$D82&\".\",IF($D$5=$K$7,$Q113&\" \"&'Components and Space Standards'!$D82&\".\",IF($D$5=$K$8,$S113&\" \"&'Components and Space Standards'!$D82&\".\",)))))","v":0},null,0,{"$f":"IF(OR($D$26<>\"Yes\",$D$26=0,$K$26<>\"Yes\"),,IF($D$5=$K$5,N113,IF($D$5=$K$6,P113,IF($D$5=$K$7,R113,IF($D$5=$K$8,T113,)))))","v":0},null,null,null,null,{"$f":"IF($D113<>0,$D113,0)","v":0},{"$f":"IF($D113<>0,$D113*'Components and Space Standards'!$C82,IF($D$21=$M$9,Army!$H76,IF($D$21=$M$10,Army!$K76,IF($D$21='Interactive Worksheet'!$M$11,Army!$N76,IF($D$21='Interactive Worksheet'!$M$12,Army!$Q76,IF($D$21='Interactive Worksheet'!$M$13,IF($M$17=0,Army!$T76,($M$17*Army!W76)+Army!T76)))))))","v":{"$error":"#N/A"}},{"$f":"IF($D113<>0,$D113,0)","v":0},{"$f":"IF(D113<>0,D113*'Components and Space Standards'!C82,IF($D$21=$M$9,Navy!H77,IF($D$21=$M$10,Navy!K77,IF($D$21='Interactive Worksheet'!$M$11,Navy!N77,IF($D$21='Interactive Worksheet'!$M$12,Navy!Q77,IF($D$21='Interactive Worksheet'!$M$13,Navy!T77,IF($O$18>0,Navy!W77,)))))))","v":{"$error":"#N/A"}},{"$f":"IF($D113<>0,$D113,0)","v":0},{"$f":"IF(D113<>0,D113*'Components and Space Standards'!C82,IF($D$21=$M$10,AF!H75,IF($D$21=$M$11,AF!K75,IF($D$21='Interactive Worksheet'!$M$12,AF!N75,))))","v":{"$error":"#N/A"}},{"$f":"IF($D113<>0,$D113,0)","v":0},{"$f":"IF($D113<>0,$D113*'Components and Space Standards'!C82,IF($D$21=$M$9,MC!H77,IF($D$21=$M$10,MC!K77,IF($D$21='Interactive Worksheet'!$M$11,MC!N77,IF($D$21='Interactive Worksheet'!$M$12,MC!Q77,IF($D$21='Interactive Worksheet'!$M$13,MC!T77,))))))","v":{"$error":"#N/A"}}]
[{"$f":"IF(OR($D$26<>\"Yes\",$D$26=0,$K$26<>\"Yes\"),,'Components and Space Standards'!A83)","v":0},null,{"$f":"IF(OR($D$26<>\"Yes\",$D$26=0,$K$26<>\"Yes\"),,\"For this option, select yes or no:\")","v":0},null,{"$f":"IF(OR($D$26<>\"Yes\",$D$26=0,$K$26<>\"Yes\"),,IF($D$5=$K$5,$M114&\" \"&'Components and Space Standards'!$D83&\".\",IF($D$5=$K$6,$O114&\" \"&'Components and Space Standards'!$D83&\".\",IF($D$5=$K$7,$Q114&\" \"&'Components and Space Standards'!$D83&\".\",IF($D$5=$K$8,$S114&\" \"&'Components and Space Standards'!$D83&\".\",)))))","v":0},null,0,0,null,{"$f":"IF(D114<>0,\"D\",)","v":0},null,null,{"$f":"IF($D114=$K$26,1,0)","v":0},{"$f":"IF($D114=$K$26,M$114*'Components and Space Standards'!$C83,0)","v":0},{"$f":"IF($D114=$K$26,1,0)","v":0},{"$f":"IF($D114=$K$26,$O114*'Components and Space Standards'!$C83,0)","v":0},null,null,{"$f":"IF($D114=$K$26,1,0)","v":0},{"$f":"IF($D114=$K$26,S$114*'Components and Space Standards'!$C83,0)","v":0},{"$f":"(H114/120)*2","v":0}]
[{"$f":"IF(OR($D$26<>\"Yes\",$D$26=0,$K$26<>\"Yes\"),,'Components and Space Standards'!A84)","v":0},null,{"$f":"IF(OR($D$26<>\"Yes\",$D$26=0,$K$26<>\"Yes\"),,\"For this option, select yes or no:\")","v":0},null,{"$f":"IF(OR($D$26<>\"Yes\",$D$26=0,$K$26<>\"Yes\"),,IF($D$5=$K$5,$M115&\" \"&'Components and Space Standards'!$D84&\".\",IF($D$5=$K$6,$O115&\" \"&'Components and Space Standards'!$D84&\".\",IF($D$5=$K$7,$Q115&\" \"&'Components and Space Standards'!$D84&\".\",IF($D$5=$K$8,$S115&\" \"&'Components and Space Standards'!$D84&\".\",)))))","v":0},null,0,0,null,0,null,null,{"$f":"IF($D115=$K$26,1,0)","v":0},{"$f":"IF($D115=$K$26,M$115*'Components and Space Standards'!$C84,0)","v":0},{"$f":"IF($D115=$K$26,1,0)","v":0},{"$f":"IF($D115=$K$26,O$115*'Components and Space Standards'!$C84,0)","v":0},null,null,{"$f":"IF($D115=$K$26,1,0)","v":0},{"$f":"IF($D115=$K$26,S$114*'Components and Space Standards'!$C84,0)","v":0},{"$f":"(H115/125)*2","v":0}]
[{"$f":"IF(OR($D$26<>\"Yes\",$D$26=0,$K$26<>\"Yes\"),,'Components and Space Standards'!A85)","v":0},null,{"$f":"IF(OR($D$26<>\"Yes\",$D$26=0,$K$26<>\"Yes\"),,\"For this option, select yes or no:\")","v":0},null,{"$f":"IF(OR($D$26<>\"Yes\",$D$26=0,$K$26<>\"Yes\"),,IF($D$5=$K$5,$M116&\" \"&'Components and Space Standards'!$D85&\".\",IF($D$5=$K$6,$O116&\" \"&'Components and Space Standards'!$D85&\".\",IF($D$5=$K$7,$Q116&\" \"&'Components and Space Standards'!$D85&\".\",IF($D$5=$K$8,$S116&\" \"&'Components and Space Standards'!$D85&\".\",)))))","v":0},null,0,0,null,0,null,null,{"$f":"IF($D116=$K$26,1,0)","v":0},{"$f":"IF($D116=$K$26,M$116*'Components and Space Standards'!$C85,0)","v":0},{"$f":"IF($D116=$K$26,1,0)","v":0},{"$f":"IF($D116=$K$26,O$116*'Components and Space Standards'!$C85,0)","v":0},null,null,{"$f":"IF($D116=$K$26,1,0)","v":0},{"$f":"IF($D116=$K$26,S$114*'Components and Space Standards'!$C85,0)","v":0}]
[{"$f":"IF(OR($D$26<>\"Yes\",$D$26=0,$K$26<>\"Yes\"),,'Components and Space Standards'!A86)","v":0},null,{"$f":"IF(OR($D$26<>\"Yes\",$D$26=0,$K$26<>\"Yes\"),,\"For this option, select yes or no:\")","v":0},null,{"$f":"IF(OR($D$26<>\"Yes\",$D$26=0,$K$26<>\"Yes\"),,IF($D$5=$K$5,$M117&\" \"&'Components and Space Standards'!$D86&\".\",IF($D$5=$K$6,$O117&\" \"&'Components and Space Standards'!$D86&\".\",IF($D$5=$K$7,$Q117&\" \"&'Components and Space Standards'!$D86&\".\",IF($D$5=$K$8,$S117&\" \"&'Components and Space Standards'!$D86&\".\",)))))","v":0},null,0,0,null,0,null,null,{"$f":"IF($D117=$K$26,1,0)","v":0},{"$f":"IF($D117=$K$26,M$117*'Components and Space Standards'!$C86,0)","v":0},{"$f":"IF($D117=$K$26,1,0)","v":0},{"$f":"IF($D117=$K$26,O$117*'Components and Space Standards'!$C86,0)","v":0},null,null,{"$f":"IF($D117=$K$26,1,0)","v":0},{"$f":"IF($D117=$K$26,S$117*'Components and Space Standards'!$C86,0)","v":0}]
[{"$f":"IF(OR($D$26<>\"Yes\",$D$26=0,$K$26<>\"Yes\"),,'Components and Space Standards'!A87)","v":0},null,{"$f":"IF(OR($D$26<>\"Yes\",$D$26=0,$K$26<>\"Yes\"),,\"For this option, enter required modules:\")","v":0},null,{"$f":"IF(OR($D$26<>\"Yes\",$D$26=0,$K$26<>\"Yes\"),,IF($D$5=$K$5,$M118&\" \"&'Components and Space Standards'!$D87&\".\",IF($D$5=$K$6,$O118&\" \"&'Components and Space Standards'!$D87&\".\",IF($D$5=$K$7,$Q118&\" \"&'Components and Space Standards'!$D87&\".\",IF($D$5=$K$8,$S118&\" \"&'Components and Space Standards'!$D87&\".\",)))))","v":0},null,0,0,null,0,null,null,{"$f":"IF($D118<>0,$D118,IF($D$21=$M$9,Army!$F81,IF($D$21=$M$10,Army!$I81,IF($D$21='Interactive Worksheet'!$M$11,Army!$L81,IF($D$21='Interactive Worksheet'!$M$12,Army!$O81,IF($D$21='Interactive Worksheet'!$M$13,IF($M$17=0,Army!$R81,($M$17*Army!U81)+Army!R81)))))))","v":{"$error":"#N/A"}},{"$f":"IF(AND($D118<>0,$D117<>\"No\"),$D118*'Components and Space Standards'!$C87,IF($D$21=$M$9,Army!$H81,IF($D$21=$M$10,Army!$K81,IF($D$21='Interactive Worksheet'!$M$11,Army!$N81,IF($D$21='Interactive Worksheet'!$M$12,Army!$Q81,IF($D$21='Interactive Worksheet'!$M$13,IF($M$17=0,Army!$T81,($M$17*Army!W81)+Army!T81)))))))","v":{"$error":"#N/A"}},{"$f":"IF(D118<>0,D118,IF($D$21=$M$9,Navy!F82,IF($D$21=$M$10,Navy!I82,IF($D$21='Interactive Worksheet'!$M$11,Navy!L82,IF($D$21='Interactive Worksheet'!$M$12,Navy!O82,IF($D$21='Interactive Worksheet'!$M$13,Navy!R82,IF($O$18>0,Navy!U82,)))))))","v":{"$error":"#N/A"}},{"$f":"IF(AND($D118<>0,$D117<>\"No\"),D118*'Components and Space Standards'!C87,IF($D$21=$M$9,Navy!H82,IF($D$21=$M$10,Navy!K82,IF($D$21='Interactive Worksheet'!$M$11,Navy!N82,IF($D$21='Interactive Worksheet'!$M$12,Navy!Q82,IF($D$21='Interactive Worksheet'!$M$13,Navy!T82,IF($O$18>0,Navy!W82,)))))))","v":{"$error":"#N/A"}},{"$f":"IF(D118<>0,D118,IF($D$21=$M$10,AF!F80,IF($D$21=$M$11,AF!I80,IF($D$21='Interactive Worksheet'!$M$12,AF!L80,))))","v":{"$error":"#N/A"}},{"$f":"IF(AND($D118<>0,$D117<>\"No\"),D118*'Components and Space Standards'!C87,IF($D$21=$M$10,AF!H80,IF($D$21=$M$11,AF!K80,IF($D$21='Interactive Worksheet'!$M$12,AF!N80,))))","v":{"$error":"#N/A"}},{"$f":"IF($D118<>0,$D118,IF($D$21=$M$9,MC!F82,IF($D$21=$M$10,MC!I82,IF($D$21='Interactive Worksheet'!$M$11,MC!L82,IF($D$21='Interactive Worksheet'!$M$12,MC!O82,IF($D$21='Interactive Worksheet'!$M$13,MC!R82,))))))","v":{"$error":"#N/A"}},{"$f":"IF(AND($D118<>0,$D117<>\"No\"),$D118*'Components and Space Standards'!C87,IF($D$21=$M$9,MC!H82,IF($D$21=$M$10,MC!K82,IF($D$21='Interactive Worksheet'!$M$11,MC!N82,IF($D$21='Interactive Worksheet'!$M$12,MC!Q82,IF($D$21='Interactive Worksheet'!$M$13,MC!T82,))))))","v":{"$error":"#N/A"}},null,null,"This option becomes available when expand juice is selected"]
[{"$f":"IF(OR($D$26<>\"Yes\",$D$26=0,$K$26<>\"Yes\"),,'Components and Space Standards'!A88)","v":0},null,{"$f":"IF(OR($D$26<>\"Yes\",$D$26=0,$K$26<>\"Yes\"),,IF(OR(D5=K5,D5=K6),\"Does this facility include a pool (yes/no)?\",IF(D5=K8,\"For this option, select yes or no:\",)))","v":0},null,{"$f":"IF(OR($D$26<>\"Yes\",$D$26=0,$K$26<>\"Yes\"),,IF($D$5=$K$5,$M119&\" \"&'Components and Space Standards'!$D88&\".\",IF($D$5=$K$6,$O119&\" \"&'Components and Space Standards'!$D88&\".\",IF($D$5=$K$7,$Q119&\" \"&'Components and Space Standards'!$D88&\".\",IF($D$5=$K$8,$S119&\" \"&'Components and Space Standards'!$D88&\".\",)))))","v":0},null,0,0,null,0,"Yes",null,{"$f":"IF($D119=\"Yes\",IF($D$21=$M$9,Army!$F82,IF($D$21=$M$10,Army!$I82,IF($D$21='Interactive Worksheet'!$M$11,Army!$L82,IF($D$21='Interactive Worksheet'!$M$12,Army!$O82,IF($D$21='Interactive Worksheet'!$M$13,IF($M$17=0,Army!$R82,($M$17*Army!U82)+Army!R82)))))),0)","v":0},{"$f":"IF($D119=\"Yes\",IF($D$21=$M$9,Army!$H82,IF($D$21=$M$10,Army!$K82,IF($D$21='Interactive Worksheet'!$M$11,Army!$N82,IF($D$21='Interactive Worksheet'!$M$12,Army!$Q82,IF($D$21='Interactive Worksheet'!$M$13,IF($M$17=0,Army!$T82,($M$17*Army!W82)+Army!T82)))))),0)","v":0},{"$f":"IF($D119=\"Yes\",IF($D$21=$M$9,Navy!F83,IF($D$21=$M$10,Navy!I83,IF($D$21='Interactive Worksheet'!$M$11,Navy!L83,IF($D$21='Interactive Worksheet'!$M$12,Navy!O83,IF($D$21='Interactive Worksheet'!$M$13,Navy!R83,IF($O$18>0,Navy!U83,)))))),0)","v":0},{"$f":"IF($D119=\"Yes\",IF($D$21=$M$9,Navy!H83,IF($D$21=$M$10,Navy!K83,IF($D$21='Interactive Worksheet'!$M$11,Navy!N83,IF($D$21='Interactive Worksheet'!$M$12,Navy!Q83,IF($D$21='Interactive Worksheet'!$M$13,Navy!T83,IF($O$18>0,Navy!W83,)))))),0)","v":0},{"$f":"IF(D119<>0,D119,IF($D$21=$M$10,AF!F81,IF($D$21=$M$11,AF!I81,IF($D$21='Interactive Worksheet'!$M$12,AF!L81,))))","v":{"$error":"#N/A"}},{"$f":"IF(D119<>0,D119*'Components and Space Standards'!C88,IF($D$21=$M$10,AF!H81,IF($D$21=$M$11,AF!K81,IF($D$21='Interactive Worksheet'!$M$12,AF!N81,))))","v":{"$error":"#N/A"}},{"$f":"IF($D119=\"Yes\",IF($D$21=$M$9,MC!F83,IF($D$21=$M$10,MC!I83,IF($D$21='Interactive Worksheet'!$M$11,MC!L83,IF($D$21='Interactive Worksheet'!$M$12,MC!O83,IF($D$21='Interactive Worksheet'!$M$13,MC!R83,))))),0)","v":0},{"$f":"IF($D119=\"Yes\",IF($D$21=$M$9,MC!H83,IF($D$21=$M$10,MC!K83,IF($D$21='Interactive Worksheet'!$M$11,MC!N83,IF($D$21='Interactive Worksheet'!$M$12,MC!Q83,IF($D$21='Interactive Worksheet'!$M$13,MC!T83,))))),0)","v":0}]
[{"$f":"IF(OR($D$26<>\"Yes\",$D$26=0,$K$26<>\"Yes\",D5=K6,L12<>1),,'Components and Space Standards'!A89)","v":0},null,{"$f":"IF(OR($D$26<>\"Yes\",$D$26=0,$K$26<>\"Yes\"),,IF(AND(D5=K8,L12=1),\"For this option, select yes or no:\",))","v":0},null,null,null,{"$f":"ROUND(H120*$K$33,2)","v":0},{"$f":"IF(OR($D$26<>\"Yes\",$D$26=0,$K$26<>\"Yes\"),,IF($D$5=$K$8,T120,))","v":0},null,{"$f":"IF(D120<>0,\"D\",)","v":0},"Yes",null,{"$f":"IF($D120=\"Yes\",IF($D$21=$M$9,Army!$F83,IF($D$21=$M$10,Army!$I83,IF($D$21='Interactive Worksheet'!$M$11,Army!$L83,IF($D$21='Interactive Worksheet'!$M$12,Army!$O83,IF($D$21='Interactive Worksheet'!$M$13,IF($M$17=0,Army!$R83,($M$17*Army!U83)+Army!R83)))))),0)","v":0},{"$f":"IF($D120=\"Yes\",IF($D$21=$M$9,Army!$H83,IF($D$21=$M$10,Army!$K83,IF($D$21='Interactive Worksheet'!$M$11,Army!$N83,IF($D$21='Interactive Worksheet'!$M$12,Army!$Q83,IF($D$21='Interactive Worksheet'!$M$13,IF($M$17=0,Army!$T83,($M$17*Army!W83)+Army!T83)))))),0)","v":0},{"$f":"IF($D120=\"Yes\",IF($D$21=$M$9,Navy!F84,IF($D$21=$M$10,Navy!I84,IF($D$21='Interactive Worksheet'!$M$11,Navy!L84,IF($D$21='Interactive Worksheet'!$M$12,Navy!O84,IF($D$21='Interactive Worksheet'!$M$13,Navy!R84,IF($O$18>0,Navy!U84,)))))),0)","v":0},{"$f":"IF($D120=\"Yes\",IF($D$21=$M$9,Navy!H84,IF($D$21=$M$10,Navy!K84,IF($D$21='Interactive Worksheet'!$M$11,Navy!N84,IF($D$21='Interactive Worksheet'!$M$12,Navy!Q84,IF($D$21='Interactive Worksheet'!$M$13,Navy!T84,IF($O$18>0,Navy!W84,)))))),0)","v":0},1,{"$f":"IF(D120<>0,'Components and Space Standards'!C89,IF($D$21=$M$10,AF!H82,IF($D$21=$M$11,AF!K82,IF($D$21='Interactive Worksheet'!$M$12,AF!N82,))))","v":{"$error":"#N/A"}},{"$f":"IF($D120=\"Yes\",IF($D$21=$M$9,MC!F84,IF($D$21=$M$10,MC!I84,IF($D$21=$M$11,MC!L84,IF($D$21=$M$12,MC!O84,IF($D$21=$M$13,MC!R84,))))),0)","v":0},{"$f":"IF(AND($D120=\"Yes\",L12=1),'Components and Space Standards'!C89,0)","v":0}]
[{"$f":"IF(OR($D$26<>\"Yes\",$D$26=0,$K$26<>\"Yes\"),,'Components and Space Standards'!A89)","v":0},null,null,null,{"$f":"IF(OR($D$26<>\"Yes\",$D$26=0,$K$26<>\"Yes\"),,IF($D$5=$K$5,$M121&\" \"&'Components and Space Standards'!$D89&\".\",IF($D$5=$K$6,$O121&\" \"&'Components and Space Standards'!$D89&\".\",IF($D$5=$K$7,$Q121&\" \"&'Components and Space Standards'!$D89&\".\",IF($D$5=$K$8,$S121&\" \"&'Components and Space Standards'!$D89&\".\",)))))","v":0},null,0,0,null,null,"No",null,{"$f":"IF($D121<>0,$D121,IF($D$21=$M$9,Army!$F83,IF($D$21=$M$10,Army!$I83,IF($D$21='Interactive Worksheet'!$M$11,Army!$L83,IF($D$21='Interactive Worksheet'!$M$12,Army!$O83,IF($D$21='Interactive Worksheet'!$M$13,IF($M$17=0,Army!$R83,($M$17*Army!U83)+Army!R83)))))))","v":{"$error":"#N/A"}},{"$f":"IF($D121<>0,$D121*'Components and Space Standards'!$C89,IF($D$21=$M$9,Army!$H83,IF($D$21=$M$10,Army!$K83,IF($D$21='Interactive Worksheet'!$M$11,Army!$N83,IF($D$21='Interactive Worksheet'!$M$12,Army!$Q83,IF($D$21='Interactive Worksheet'!$M$13,IF($M$17=0,Army!$T83,($M$17*Army!W83)+Army!T83)))))))","v":{"$error":"#N/A"}},{"$f":"IF(D121<>0,D121,IF($D$21=$M$9,Navy!F84,IF($D$21=$M$10,Navy!I84,IF($D$21='Interactive Worksheet'!$M$11,Navy!L84,IF($D$21='Interactive Worksheet'!$M$12,Navy!O84,IF($D$21='Interactive Worksheet'!$M$13,Navy!R84,IF($O$18>0,Navy!U84,)))))))","v":{"$error":"#N/A"}},{"$f":"IF(D121<>0,D121*'Components and Space Standards'!C89,IF($D$21=$M$9,Navy!H84,IF($D$21=$M$10,Navy!K84,IF($D$21='Interactive Worksheet'!$M$11,Navy!N84,IF($D$21='Interactive Worksheet'!$M$12,Navy!Q84,IF($D$21='Interactive Worksheet'!$M$13,Navy!T84,IF($O$18>0,Navy!W84,)))))))","v":{"$error":"#N/A"}},{"$f":"IF(D121<>0,D121,IF($D$21=$M$10,AF!F82,IF($D$21=$M$11,AF!I82,IF($D$21='Interactive Worksheet'!$M$12,AF!L82,))))","v":{"$error":"#N/A"}},{"$f":"IF(D121<>0,D121*'Components and Space Standards'!C89,IF($D$21=$M$10,AF!H82,IF($D$21=$M$11,AF!K82,IF($D$21='Interactive Worksheet'!$M$12,AF!N82,))))","v":{"$error":"#N/A"}},{"$f":"IF($D121<>0,$D121,IF($D$21=$M$9,MC!F84,IF($D$21=$M$10,MC!I84,IF($D$21='Interactive Worksheet'!$M$11,MC!L84,IF($D$21='Interactive Worksheet'!$M$12,MC!O84,IF($D$21='Interactive Worksheet'!$M$13,MC!R84,))))))","v":{"$error":"#N/A"}},{"$f":"IF($D121<>0,$D121*'Components and Space Standards'!C89,IF($D$21=$M$9,MC!H84,IF($D$21=$M$10,MC!K84,IF($D$21='Interactive Worksheet'!$M$11,MC!N84,IF($D$21='Interactive Worksheet'!$M$12,MC!Q84,IF($D$21='Interactive Worksheet'!$M$13,MC!T84,))))))","v":{"$error":"#N/A"}}]
[{"$f":"IF(OR($D$26<>\"Yes\",$D$26=0,$K$26<>\"Yes\"),,'Components and Space Standards'!A90)","v":0},null,null,null,{"$f":"IF(OR($D$26<>\"Yes\",$D$26=0,$K$26<>\"Yes\"),,IF($D$5=$K$5,$M122&\" \"&'Components and Space Standards'!$D90&\".\",IF($D$5=$K$6,$O122&\" \"&'Components and Space Standards'!$D90&\".\",IF($D$5=$K$7,$Q122&\" \"&'Components and Space Standards'!$D90&\".\",IF($D$5=$K$8,$S122&\" \"&'Components and Space Standards'!$D90&\".\",)))))","v":0},null,0,0,null,null,null,null,{"$f":"IF($D122<>0,$D122,IF($D$21=$M$9,Army!$F84,IF($D$21=$M$10,Army!$I84,IF($D$21='Interactive Worksheet'!$M$11,Army!$L84,IF($D$21='Interactive Worksheet'!$M$12,Army!$O84,IF($D$21='Interactive Worksheet'!$M$13,IF($M$17=0,Army!$R84,($M$17*Army!U84)+Army!R84)))))))","v":{"$error":"#N/A"}},{"$f":"IF($D122<>0,$D122*'Components and Space Standards'!$C90,IF($D$21=$M$9,Army!$H84,IF($D$21=$M$10,Army!$K84,IF($D$21='Interactive Worksheet'!$M$11,Army!$N84,IF($D$21='Interactive Worksheet'!$M$12,Army!$Q84,IF($D$21='Interactive Worksheet'!$M$13,IF($M$17=0,Army!$T84,($M$17*Army!W84)+Army!T84)))))))","v":{"$error":"#N/A"}},{"$f":"IF(D122<>0,D122,IF($D$21=$M$9,Navy!F85,IF($D$21=$M$10,Navy!I85,IF($D$21='Interactive Worksheet'!$M$11,Navy!L85,IF($D$21='Interactive Worksheet'!$M$12,Navy!O85,IF($D$21='Interactive Worksheet'!$M$13,Navy!R85,IF($O$18>0,Navy!U85,)))))))","v":{"$error":"#N/A"}},{"$f":"IF(D122<>0,D122*'Components and Space Standards'!C90,IF($D$21=$M$9,Navy!H85,IF($D$21=$M$10,Navy!K85,IF($D$21='Interactive Worksheet'!$M$11,Navy!N85,IF($D$21='Interactive Worksheet'!$M$12,Navy!Q85,IF($D$21='Interactive Worksheet'!$M$13,Navy!T85,IF($O$18>0,Navy!W85,)))))))","v":{"$error":"#N/A"}},{"$f":"IF(D122<>0,D122,IF($D$21=$M$10,AF!F83,IF($D$21=$M$11,AF!I83,IF($D$21='Interactive Worksheet'!$M$12,AF!L83,))))","v":{"$error":"#N/A"}},{"$f":"IF(D122<>0,D122*'Components and Space Standards'!C90,IF($D$21=$M$10,AF!H83,IF($D$21=$M$11,AF!K83,IF($D$21='Interactive Worksheet'!$M$12,AF!N83,))))","v":{"$error":"#N/A"}},{"$f":"IF($D122<>0,$D122,IF($D$21=$M$9,MC!F85,IF($D$21=$M$10,MC!I85,IF($D$21='Interactive Worksheet'!$M$11,MC!L85,IF($D$21='Interactive Worksheet'!$M$12,MC!O85,IF($D$21='Interactive Worksheet'!$M$13,MC!R85,))))))","v":{"$error":"#N/A"}},{"$f":"IF($D122<>0,$D122*'Components and Space Standards'!C90,IF($D$21=$M$9,MC!H85,IF($D$21=$M$10,MC!K85,IF($D$21='Interactive Worksheet'!$M$11,MC!N85,IF($D$21='Interactive Worksheet'!$M$12,MC!Q85,IF($D$21='Interactive Worksheet'!$M$13,MC!T85,))))))","v":{"$error":"#N/A"}}]
[{"$f":"IF(OR($D$26<>\"Yes\",$D$26=0,$K$26<>\"Yes\"),,'Components and Space Standards'!A91)","v":0},null,{"$f":"IF(OR($D$26<>\"Yes\",$D$26=0,$K$26<>\"Yes\"),,\"For this option, select yes or no:\")","v":0},null,{"$f":"IF(OR($D$26<>\"Yes\",$D$26=0,$K$26<>\"Yes\"),,IF($D$5=$K$5,$M123&\" \"&'Components and Space Standards'!$D91&\".\",IF($D$5=$K$6,$O123&\" \"&'Components and Space Standards'!$D91&\".\",IF($D$5=$K$7,$Q123&\" \"&'Components and Space Standards'!$D91&\".\",IF($D$5=$K$8,$S123&\" \"&'Components and Space Standards'!$D91&\".\",)))))","v":0},null,0,{"$f":"IF(OR($D$26<>\"Yes\",$D$26=0,$K$26<>\"Yes\"),,IF($D$5=$K$5,N123,IF($D$5=$K$6,P123,IF($D$5=$K$7,R123,IF($D$5=$K$8,T123,)))))","v":0},null,{"$f":"IF(D123<>0,\"D\",)","v":0},{"$f":"IF($D$5=$K$8,\"Yes\",)","v":0},null,{"$f":"IF($D123<>0,$D123,IF($D$21=$M$9,Army!$F85,IF($D$21=$M$10,Army!$I85,IF($D$21='Interactive Worksheet'!$M$11,Army!$L85,IF($D$21='Interactive Worksheet'!$M$12,Army!$O85,IF($D$21='Interactive Worksheet'!$M$13,IF($M$17=0,Army!$R85,($M$17*Army!U85)+Army!R85)))))))","v":{"$error":"#N/A"}},{"$f":"IF($D123<>0,$D123*'Components and Space Standards'!$C91,IF($D$21=$M$9,Army!$H85,IF($D$21=$M$10,Army!$K85,IF($D$21='Interactive Worksheet'!$M$11,Army!$N85,IF($D$21='Interactive Worksheet'!$M$12,Army!$Q85,IF($D$21='Interactive Worksheet'!$M$13,IF($M$17=0,Army!$T85,($M$17*Army!W85)+Army!T85)))))))","v":{"$error":"#N/A"}},{"$f":"IF(D123<>0,D123,IF($D$21=$M$9,Navy!F86,IF($D$21=$M$10,Navy!I86,IF($D$21='Interactive Worksheet'!$M$11,Navy!L86,IF($D$21='Interactive Worksheet'!$M$12,Navy!O86,IF($D$21='Interactive Worksheet'!$M$13,Navy!R86,IF($O$18>0,Navy!U86,)))))))","v":{"$error":"#N/A"}},{"$f":"IF(D123<>0,D123*'Components and Space Standards'!C91,IF($D$21=$M$9,Navy!H86,IF($D$21=$M$10,Navy!K86,IF($D$21='Interactive Worksheet'!$M$11,Navy!N86,IF($D$21='Interactive Worksheet'!$M$12,Navy!Q86,IF($D$21='Interactive Worksheet'!$M$13,Navy!T86,IF($O$18>0,Navy!W86,)))))))","v":{"$error":"#N/A"}},{"$f":"IF(D123<>0,D123,IF($D$21=$M$10,AF!F84,IF($D$21=$M$11,AF!I84,IF($D$21='Interactive Worksheet'!$M$12,AF!L84,))))","v":{"$error":"#N/A"}},{"$f":"IF(D123<>0,D123*'Components and Space Standards'!C91,IF($D$21=$M$10,AF!H84,IF($D$21=$M$11,AF!K84,IF($D$21='Interactive Worksheet'!$M$12,AF!N84,))))","v":{"$error":"#N/A"}},{"$f":"IF($D123=\"Yes\",IF($D$21=$M$9,MC!F86,IF($D$21=$M$10,MC!I86,IF($D$21='Interactive Worksheet'!$M$11,MC!L86,IF($D$21='Interactive Worksheet'!$M$12,MC!O86,IF($D$21='Interactive Worksheet'!$M$13,MC!R86,))))),0)","v":0},{"$f":"IF($D123=\"Yes\",IF($D$21=$M$9,MC!H86,IF($D$21=$M$10,MC!K86,IF($D$21='Interactive Worksheet'!$M$11,MC!N86,IF($D$21='Interactive Worksheet'!$M$12,MC!Q86,IF($D$21='Interactive Worksheet'!$M$13,MC!T86,))))),0)","v":0},{"$f":"((H123*0.5)/50)*1","v":0}]
[{"$f":"IF(OR($D$26<>\"Yes\",$D$26=0,$K$26<>\"Yes\",D5=K6),,'Components and Space Standards'!A62)","v":0},null,null,null,{"$f":"IF(OR($D$26<>\"Yes\",$D$26=0,$K$26<>\"Yes\"),,IF($D$5=$K$5,$M124&\" \"&'Components and Space Standards'!$D92&\".\",IF($D$5=$K$6,$O124&\" \"&'Components and Space Standards'!$D92&\".\",IF($D$5=$K$7,$Q124&\" \"&'Components and Space Standards'!$D92&\".\",IF($D$5=$K$8,$S124&\" \"&'Components and Space Standards'!$D92&\".\",)))))","v":0},null,0,0,null,null,{"$f":"IF($D$5=$K$8,\"No\",)","v":0},null,{"$f":"IF($D124<>0,$D124,IF($D$21=$M$9,Army!$F86,IF($D$21=$M$10,Army!$I86,IF($D$21='Interactive Worksheet'!$M$11,Army!$L86,IF($D$21='Interactive Worksheet'!$M$12,Army!$O86,IF($D$21='Interactive Worksheet'!$M$13,IF($M$17=0,Army!$R86,($M$17*Army!U86)+Army!R86)))))))","v":{"$error":"#N/A"}},{"$f":"IF($D124<>0,$D124*'Components and Space Standards'!$C92,IF($D$21=$M$9,Army!$H86,IF($D$21=$M$10,Army!$K86,IF($D$21='Interactive Worksheet'!$M$11,Army!$N86,IF($D$21='Interactive Worksheet'!$M$12,Army!$Q86,IF($D$21='Interactive Worksheet'!$M$13,IF($M$17=0,Army!$T86,($M$17*Army!W86)+Army!T86)))))))","v":{"$error":"#N/A"}},{"$f":"IF(D124<>0,D124,IF($D$21=$M$9,Navy!F87,IF($D$21=$M$10,Navy!I87,IF($D$21='Interactive Worksheet'!$M$11,Navy!L87,IF($D$21='Interactive Worksheet'!$M$12,Navy!O87,IF($D$21='Interactive Worksheet'!$M$13,Navy!R87,IF($O$18>0,Navy!U87,)))))))","v":{"$error":"#N/A"}},{"$f":"IF(D124<>0,D124*'Components and Space Standards'!C92,IF($D$21=$M$9,Navy!H87,IF($D$21=$M$10,Navy!K87,IF($D$21='Interactive Worksheet'!$M$11,Navy!N87,IF($D$21='Interactive Worksheet'!$M$12,Navy!Q87,IF($D$21='Interactive Worksheet'!$M$13,Navy!T87,IF($O$18>0,Navy!W87,)))))))","v":{"$error":"#N/A"}},{"$f":"IF(D124<>0,D124,IF($D$21=$M$10,AF!F85,IF($D$21=$M$11,AF!I85,IF($D$21='Interactive Worksheet'!$M$12,AF!L85,))))","v":{"$error":"#N/A"}},{"$f":"IF(D124<>0,D124*'Components and Space Standards'!C92,IF($D$21=$M$10,AF!H85,IF($D$21=$M$11,AF!K85,IF($D$21='Interactive Worksheet'!$M$12,AF!N85,))))","v":{"$error":"#N/A"}},{"$f":"IF($D124<>0,$D124,IF($D$21=$M$9,MC!F87,IF($D$21=$M$10,MC!I87,IF($D$21='Interactive Worksheet'!$M$11,MC!L87,IF($D$21='Interactive Worksheet'!$M$12,MC!O87,IF($D$21='Interactive Worksheet'!$M$13,MC!R87,))))))","v":{"$error":"#N/A"}},{"$f":"IF($D124<>0,$D124*'Components and Space Standards'!C92,IF($D$21=$M$9,MC!H87,IF($D$21=$M$10,MC!K87,IF($D$21='Interactive Worksheet'!$M$11,MC!N87,IF($D$21='Interactive Worksheet'!$M$12,MC!Q87,IF($D$21='Interactive Worksheet'!$M$13,MC!T87,))))))","v":{"$error":"#N/A"}}]
[{"$f":"IF(OR($D$26<>\"Yes\",$D$26=0,$K$26<>\"Yes\"),,'Components and Space Standards'!A93)","v":0},null,null,null,{"$f":"IF(OR($D$26<>\"Yes\",$D$26=0,$K$26<>\"Yes\"),,IF($D$5=$K$5,$M125&\" \"&'Components and Space Standards'!$D93&\".\",IF($D$5=$K$6,$O125&\" \"&'Components and Space Standards'!$D93&\".\",IF($D$5=$K$7,$Q125&\" \"&'Components and Space Standards'!$D93&\".\",IF($D$5=$K$8,$S125&\" \"&'Components and Space Standards'!$D93&\".\",)))))","v":0},null,{"$f":"ROUND(H125*$K$33,2)","v":0},0,null,null,null,null,{"$f":"IF($D125<>0,$D125,IF($D$21=$M$9,Army!$F87,IF($D$21=$M$10,Army!$I87,IF($D$21='Interactive Worksheet'!$M$11,Army!$L87,IF($D$21='Interactive Worksheet'!$M$12,Army!$O87,IF($D$21='Interactive Worksheet'!$M$13,IF($M$17=0,Army!$R87,($M$17*Army!U87)+Army!R87)))))))","v":{"$error":"#N/A"}},{"$f":"IF($D125<>0,$D125*'Components and Space Standards'!$C93,IF($D$21=$M$9,Army!$H87,IF($D$21=$M$10,Army!$K87,IF($D$21='Interactive Worksheet'!$M$11,Army!$N87,IF($D$21='Interactive Worksheet'!$M$12,Army!$Q87,IF($D$21='Interactive Worksheet'!$M$13,IF($M$17=0,Army!$T87,($M$17*Army!W87)+Army!T87)))))))","v":{"$error":"#N/A"}},{"$f":"IF(D125<>0,D125,IF($D$21=$M$9,Navy!F88,IF($D$21=$M$10,Navy!I88,IF($D$21='Interactive Worksheet'!$M$11,Navy!L88,IF($D$21='Interactive Worksheet'!$M$12,Navy!O88,IF($D$21='Interactive Worksheet'!$M$13,Navy!R88,IF($O$18>0,Navy!U88,)))))))","v":{"$error":"#N/A"}},{"$f":"IF(D125<>0,D125*'Components and Space Standards'!C93,IF($D$21=$M$9,Navy!H88,IF($D$21=$M$10,Navy!K88,IF($D$21='Interactive Worksheet'!$M$11,Navy!N88,IF($D$21='Interactive Worksheet'!$M$12,Navy!Q88,IF($D$21='Interactive Worksheet'!$M$13,Navy!T88,IF($O$18>0,Navy!W88,)))))))","v":{"$error":"#N/A"}},{"$f":"IF(D125<>0,D125,IF($D$21=$M$10,AF!F86,IF($D$21=$M$11,AF!I86,IF($D$21='Interactive Worksheet'!$M$12,AF!L86,))))","v":{"$error":"#N/A"}},{"$f":"IF(D125<>0,D125*'Components and Space Standards'!C93,IF($D$21=$M$10,AF!H86,IF($D$21=$M$11,AF!K86,IF($D$21='Interactive Worksheet'!$M$12,AF!N86,))))","v":{"$error":"#N/A"}},{"$f":"IF($D125<>0,$D125,IF($D$21=$M$9,MC!F88,IF($D$21=$M$10,MC!I88,IF($D$21='Interactive Worksheet'!$M$11,MC!L88,IF($D$21='Interactive Worksheet'!$M$12,MC!O88,IF($D$21='Interactive Worksheet'!$M$13,MC!R88,))))))","v":{"$error":"#N/A"}},{"$f":"IF($D125<>0,$D125*'Components and Space Standards'!C93,IF($D$21=$M$9,MC!H88,IF($D$21=$M$10,MC!K88,IF($D$21='Interactive Worksheet'!$M$11,MC!N88,IF($D$21='Interactive Worksheet'!$M$12,MC!Q88,IF($D$21='Interactive Worksheet'!$M$13,MC!T88,))))))","v":{"$error":"#N/A"}}]
[null,null,null,null,null,null,null,null,null,null,null,null,"Break in sequence - Refs to Space sheet, rows 34 to 42 are below.",null,null,null,null,null,null,null,{"$f":"ROUNDUP(SUM(U35:U125),0)","v":2}]
[{"$f":"IF(OR($D$26<>\"Yes\",$D$26=0,$K$26<>\"Yes\"),,'Components and Space Standards'!A36)","v":0}]
[{"$f":"IF(OR($D$26<>\"Yes\",$D$26=0,$K$26<>\"Yes\"),,\"The following Locker Room spaces are based on total building occupancy, which is driven by the selctions made on this spreadsheet.\")","v":0},null,null,null,null,null,null,null,null,null,"50% Male / 50% Female"]
[null,null,null,null,null,null,null,null,null,null,"60% Male / 40% Female"]
[null,null,null,null,null,null,null,null,null,null,"70% Male / 30% Female"]
[{"$f":"IF(OR($D$26<>\"Yes\",$D$26=0,$K$26<>\"Yes\"),,IF($D$5=$K$5,M131,IF($D$5=$K$6,O131,IF($D$5=$K$7,Q131,IF($D$5=$K$8,S131,)))))","v":0},null,null,null,{"$f":"IF(OR($D$26<>\"Yes\",$D$26=0,$K$26<>\"Yes\"),,\"To change this default split, select new:\")","v":0},null,null,null,null,{"$f":"IF(F131<>0,\"F\",)","v":0},"80% Male / 20% Female",null,"Army allocates the locker area at a 60% Male and 40% Female split.",{"$f":"IF($F$131<>0,(IF($F$131=$K$128,0.5,IF($F$131=$K$129,0.6,IF($F$131=$K$130,0.7,IF($F$131=$K$131,0.8,IF($F$131=$K$132,0.9,0.6)))))),0.6)","v":0.6},"Navy allocates the locker area at a 60% Male and 40% Female split.",{"$f":"IF($F$131<>0,(IF($F$131=$K$128,0.5,IF($F$131=$K$129,0.6,IF($F$131=$K$130,0.7,IF($F$131=$K$131,0.8,IF($F$131=$K$132,0.9,0.6)))))),0.6)","v":0.6},"Air Force allocates the locker area at a 60% Male and 40% Female split.",{"$f":"IF($F$131<>0,(IF($F$131=$K$128,0.5,IF($F$131=$K$129,0.6,IF($F$131=$K$130,0.7,IF($F$131=$K$131,0.8,IF($F$131=$K$132,0.9,0.6)))))),0.6)","v":0.6},"Marine Corps allocates the locker area at a 80% Male and 20% Female split.",{"$f":"IF($F$131<>0,(IF($F$131=$K$128,0.5,IF($F$131=$K$129,0.6,IF($F$131=$K$130,0.7,IF($F$131=$K$131,0.8,IF($F$131=$K$132,0.9,0.8)))))),0.8)","v":0.8},null,null,"Can go from a 50-50 split up to a 90-10 male/female split."]
[null,null,null,null,null,null,null,null,null,null,"90% Male / 10% Female"]
[{"$f":"IF(OR($D$26<>\"Yes\",$D$26=0,$K$26<>\"Yes\"),,'Components and Space Standards'!A37)","v":0},null,null,null,null,null,{"$f":"ROUND(H133*$K$33,2)","v":0},{"$f":"IF(OR($D$26<>\"Yes\",$D$26=0,$K$26<>\"Yes\"),,IF($D$5=$K$5,N133,IF($D$5=$K$6,P133,IF($D$5=$K$7,R133,IF($D$5=$K$8,T133,)))))","v":0},null,null,null,null,null,{"$f":"(N134+N138+N139)","v":8},null,{"$f":"(P134+P138+P139)","v":8},null,null,null,{"$f":"(T134+T138+T139)","v":8}]
[{"$f":"IF(OR($D$26<>\"Yes\",$D$26=0,$K$26<>\"Yes\"),,'Components and Space Standards'!A38)","v":0},null,{"$f":"IF(OR($D$26<>\"Yes\",$D$26=0,$K$26<>\"Yes\"),,\"To change default, select new:\")","v":0},null,{"$f":"IF(OR($D$26<>\"Yes\",$D$26=0,$K$26<>\"Yes\"),,IF($D$5=$K$5,L134&\" \"&'Components and Space Standards'!$D38&\" in \"&M134&\" slots.\",IF($D$5=$K$6,L134&\" \"&'Components and Space Standards'!$D38&\" in \"&O134&\" slots.\",IF($D$5=$K$7,L134&\" \"&'Components and Space Standards'!$D38&\" in \"&Q134&\" slots.\",IF($D$5=$K$8,L134&\" \"&'Components and Space Standards'!$D38&\" in \"&S134&\" slots.\",)))))","v":0},null,null,null,null,{"$f":"IF(D134<>0,\"D\",)","v":0},{"$f":"IF(D134=0,0.66,IF(D134=$K$136,0.5,IF(D134=$K$137,0.6,IF(D134=$K$138,0.75,IF(D134=$K$139,1,0.66)))))","v":0.66},{"$f":"ROUND(IF($D$5=$K$5,$M134/$K134,IF($D$5=$K$6,$O134/$K134,IF($D$5=$K$7,$Q134/$K134,IF($D$5=$K$8,$S134/$K134,)))),0)","v":2},{"$f":"ROUND($K$134*N$131*$U$126,0)","v":1},{"$f":"M134*'Components and Space Standards'!$C$38","v":8},{"$f":"ROUND($K$134*P131*$U$126,0)","v":1},{"$f":"O134*'Components and Space Standards'!$C$38","v":8},{"$f":"IF(D134<>0,D134,IF($D$21=$M$10,AF!F36,IF($D$21=$M$11,AF!I36,IF($D$21='Interactive Worksheet'!$M$12,AF!L36,))))","v":{"$error":"#N/A"}},{"$f":"IF(D134<>0,D134*'Components and Space Standards'!C38,IF($D$21=$M$10,AF!H36,IF($D$21=$M$11,AF!K36,IF($D$21='Interactive Worksheet'!$M$12,AF!N36,))))","v":{"$error":"#N/A"}},{"$f":"ROUND($K$134*T131*$U$126,0)","v":1},{"$f":"S134*'Components and Space Standards'!$C$38","v":8},null,null,"Options to change the number of half-sized vs. full-sized lockers vary by Service."]
[{"$f":"IF(OR($D$26<>\"Yes\",$D$26=0,$K$26<>\"Yes\"),,IF(D5=K5,\"Army designates 2 spaces (slots) for every 3 lockers (66%).  This is 1 full-sized & 2 half-sized lockers for every 3 required.  To change this default (with CFSC approval), select new configuration.  ALSO: See Women's \"&'Components and Space Standards'!A42&\".\",IF(D5=K6,\"Navy designates 2 spaces (slots) for every 3 lockers (66%).  This is 1 full-sized & 2 half-sized lockers for every 3 required.  To change this default, select new configuration.  ALSO: See Women's \"&'Components and Space Standards'!A42&\".\",IF(D5=K8,\"Marine Corps designates 2 spaces (slots) for every 3 lockers (66%).  This is 1 full-sized & 2 half-sized lockers for every 3 required.  To change this default, select new configuration.  ALSO: See Women's \"&'Components and Space Standards'!A42&\".\"))))","v":0}]
[null,null,null,null,null,null,null,null,null,null,{"$f":"IF(D5=K5,,\"2 lockers/1 slot\")","v":0}]
[null,null,null,null,null,null,null,null,null,null,"5 lockers/3 slots"]
[{"$f":"IF(OR($D$26<>\"Yes\",$D$26=0,$K$26<>\"Yes\"),,'Components and Space Standards'!A39)","v":0},null,null,null,{"$f":"IF(OR($D$26<>\"Yes\",$D$26=0,$K$26<>\"Yes\"),,IF($D$5=$K$5,$M138&\" \"&'Components and Space Standards'!$D39&\".\",IF($D$5=$K$6,$O138&\" \"&'Components and Space Standards'!$D39&\".\",IF($D$5=$K$7,$Q138&\" \"&'Components and Space Standards'!$D39&\".\",IF($D$5=$K$8,$S138&\" \"&'Components and Space Standards'!$D39&\".\",)))))","v":0},null,null,null,null,null,"4 lockers/3 slots",null,{"$f":"ROUND(IF($D138<>0,$D138,($L$134/22)),0)","v":0},{"$f":"M138*'Components and Space Standards'!$C39","v":0},{"$f":"ROUND(IF($D138<>0,$D138,($L$134/22)),0)","v":0},{"$f":"O138*'Components and Space Standards'!$C39","v":0},{"$f":"IF(D138<>0,D138,IF($D$21=$M$10,AF!F37,IF($D$21=$M$11,AF!I37,IF($D$21='Interactive Worksheet'!$M$12,AF!L37,))))","v":{"$error":"#N/A"}},{"$f":"IF(D138<>0,D138*'Components and Space Standards'!C39,IF($D$21=$M$10,AF!H37,IF($D$21=$M$11,AF!K37,IF($D$21='Interactive Worksheet'!$M$12,AF!N37,))))","v":{"$error":"#N/A"}},{"$f":"ROUND(IF($D138<>0,$D138,($L$134/22)),0)","v":0},{"$f":"S138*'Components and Space Standards'!$C39","v":0}]
[{"$f":"IF(OR($D$26<>\"Yes\",$D$26=0,$K$26<>\"Yes\"),,'Components and Space Standards'!A40)","v":0},null,null,null,{"$f":"IF(OR($D$26<>\"Yes\",$D$26=0,$K$26<>\"Yes\"),,IF($D$5=$K$5,$M139&\" \"&'Components and Space Standards'!$D40&\".\",IF($D$5=$K$6,$O139&\" \"&'Components and Space Standards'!$D40&\".\",IF($D$5=$K$7,$Q139&\" \"&'Components and Space Standards'!$D40&\".\",IF($D$5=$K$8,$S139&\" \"&'Components and Space Standards'!$D40&\".\",)))))","v":0},null,null,null,null,null,{"$f":"IF(D5=K5,,\"1 locker/1 slot\")","v":0},null,{"$f":"ROUND(IF($D139<>0,$D139,($L$134/30)),0)","v":0},{"$f":"M139*'Components and Space Standards'!$C40","v":0},{"$f":"ROUND(IF($D139<>0,$D139,($L$134/30)),0)","v":0},{"$f":"O139*'Components and Space Standards'!$C40","v":0},{"$f":"IF(D139<>0,D139,IF($D$21=$M$10,AF!F38,IF($D$21=$M$11,AF!I38,IF($D$21='Interactive Worksheet'!$M$12,AF!L38,))))","v":{"$error":"#N/A"}},{"$f":"IF(D139<>0,D139*'Components and Space Standards'!C40,IF($D$21=$M$10,AF!H38,IF($D$21=$M$11,AF!K38,IF($D$21='Interactive Worksheet'!$M$12,AF!N38,))))","v":{"$error":"#N/A"}},{"$f":"ROUND(IF($D139<>0,$D139,($L$134/30)),0)","v":0},{"$f":"S139*'Components and Space Standards'!$C40","v":0}]
[{"$f":"IF(OR($D$26<>\"Yes\",$D$26=0,$K$26<>\"Yes\"),,'Components and Space Standards'!A41)","v":0},null,null,null,null,null,{"$f":"ROUND(H140*$K$33,2)","v":0},{"$f":"IF(OR($D$26<>\"Yes\",$D$26=0,$K$26<>\"Yes\"),,IF($D$5=$K$5,N140,IF($D$5=$K$6,P140,IF($D$5=$K$7,R140,IF($D$5=$K$8,T140,)))))","v":0},null,null,null,null,null,{"$f":"(N141+N142+N143)","v":8},null,{"$f":"(P141+P142+P143)","v":8},null,null,null,{"$f":"(T141+T142+T143)","v":0}]
[{"$f":"IF(OR($D$26<>\"Yes\",$D$26=0,$K$26<>\"Yes\"),,'Components and Space Standards'!A42)","v":0},null,{"$f":"IF(OR($D$26<>\"Yes\",$D$26=0,$K$26<>\"Yes\"),,\"To change default, select new:\")","v":0},null,{"$f":"IF(OR($D$26<>\"Yes\",$D$26=0,$K$26<>\"Yes\"),,IF($D$5=$K$5,L141&\" \"&'Components and Space Standards'!$D42&\" in \"&M141&\" slots.\",IF($D$5=$K$6,L141&\" \"&'Components and Space Standards'!$D42&\" in \"&O141&\" slots.\",IF($D$5=$K$7,L141&\" \"&'Components and Space Standards'!$D42&\" in \"&Q141&\" slots.\",IF($D$5=$K$8,L141&\" \"&'Components and Space Standards'!$D42&\" in \"&S141&\" slots.\",)))))","v":0},null,null,null,null,{"$f":"IF(D141<>0,\"D\",)","v":0},{"$f":"IF(D141=0,0.66,IF(D141=$K$136,0.5,IF(D141=$K$137,0.6,IF(D141=$K$138,0.75,IF(D141=$K$139,1,0.66)))))","v":0.66},{"$f":"ROUND(IF($D$5=$K$5,$M141/$K141,IF($D$5=$K$6,$O141/$K141,IF($D$5=$K$7,$Q141/$K141,IF($D$5=$K$8,$S141/$K141,)))),0)","v":2},{"$f":"ROUND($K$141*(1-N$131)*$U$126,0)","v":1},{"$f":"M141*'Components and Space Standards'!$C$38","v":8},{"$f":"ROUND($K$141*(1-P$131)*$U$126,0)","v":1},{"$f":"O141*'Components and Space Standards'!$C$38","v":8},{"$f":"IF(D141<>0,D141,IF($D$21=$M$10,AF!F40,IF($D$21=$M$11,AF!I40,IF($D$21='Interactive Worksheet'!$M$12,AF!L40,))))","v":{"$error":"#N/A"}},{"$f":"IF(D141<>0,D141*'Components and Space Standards'!C42,IF($D$21=$M$10,AF!H40,IF($D$21=$M$11,AF!K40,IF($D$21='Interactive Worksheet'!$M$12,AF!N40,))))","v":{"$error":"#N/A"}},{"$f":"ROUND($K$141*(1-T$131)*$U$126,0)","v":0},{"$f":"S141*'Components and Space Standards'!$C$38","v":0}]
[{"$f":"IF(OR($D$26<>\"Yes\",$D$26=0,$K$26<>\"Yes\"),,'Components and Space Standards'!A43)","v":0},null,null,null,{"$f":"IF(OR($D$26<>\"Yes\",$D$26=0,$K$26<>\"Yes\"),,IF($D$5=$K$5,$M142&\" \"&'Components and Space Standards'!$D43&\".\",IF($D$5=$K$6,$O142&\" \"&'Components and Space Standards'!$D43&\".\",IF($D$5=$K$7,$Q142&\" \"&'Components and Space Standards'!$D43&\".\",IF($D$5=$K$8,$S142&\" \"&'Components and Space Standards'!$D43&\".\",)))))","v":0},null,null,null,null,null,null,null,{"$f":"ROUND(IF($D142<>0,$D142,($L$141/22)),0)","v":0},{"$f":"M142*'Components and Space Standards'!$C43","v":0},{"$f":"ROUND(IF($D142<>0,$D142,($L$141/22)),0)","v":0},{"$f":"O142*'Components and Space Standards'!$C43","v":0},{"$f":"IF(D142<>0,D142,IF($D$21=$M$10,AF!F41,IF($D$21=$M$11,AF!I41,IF($D$21='Interactive Worksheet'!$M$12,AF!L41,))))","v":{"$error":"#N/A"}},{"$f":"IF(D142<>0,D142*'Components and Space Standards'!C43,IF($D$21=$M$10,AF!H41,IF($D$21=$M$11,AF!K41,IF($D$21='Interactive Worksheet'!$M$12,AF!N41,))))","v":{"$error":"#N/A"}},{"$f":"ROUND(IF($D142<>0,$D142,($L$141/22)),0)","v":0},{"$f":"S142*'Components and Space Standards'!$C43","v":0}]
[{"$f":"IF(OR($D$26<>\"Yes\",$D$26=0,$K$26<>\"Yes\"),,'Components and Space Standards'!A44)","v":0},null,null,null,{"$f":"IF(OR($D$26<>\"Yes\",$D$26=0,$K$26<>\"Yes\"),,IF($D$5=$K$5,$M143&\" \"&'Components and Space Standards'!$D44&\".\",IF($D$5=$K$6,$O143&\" \"&'Components and Space Standards'!$D44&\".\",IF($D$5=$K$7,$Q143&\" \"&'Components and Space Standards'!$D44&\".\",IF($D$5=$K$8,$S143&\" \"&'Components and Space Standards'!$D44&\".\",)))))","v":0},null,null,null,null,null,null,null,{"$f":"ROUND(IF($D143<>0,$D143,($L$141/20)),0)","v":0},{"$f":"M143*'Components and Space Standards'!$C44","v":0},{"$f":"ROUND(IF($D143<>0,$D143,($L$141/20)),0)","v":0},{"$f":"O143*'Components and Space Standards'!$C44","v":0},{"$f":"IF(D143<>0,D143,IF($D$21=$M$10,AF!F42,IF($D$21=$M$11,AF!I42,IF($D$21='Interactive Worksheet'!$M$12,AF!L42,))))","v":{"$error":"#N/A"}},{"$f":"IF(D143<>0,D143*'Components and Space Standards'!C44,IF($D$21=$M$10,AF!H42,IF($D$21=$M$11,AF!K42,IF($D$21='Interactive Worksheet'!$M$12,AF!N42,))))","v":{"$error":"#N/A"}},{"$f":"ROUND(IF($D143<>0,$D143,($L$141/20)),0)","v":0},{"$f":"S143*'Components and Space Standards'!$C44","v":0}]
[]
["Building Totals",null,null,null,null,null,null,null,null,null,null,null,null,null,{"$f":"IF(D145<>0,D145,IF($D$21=$M$9,Navy!F90,IF($D$21=$M$10,Navy!I90,IF($D$21='Interactive Worksheet'!$M$11,Navy!L90,IF($D$21='Interactive Worksheet'!$M$12,Navy!O90,IF($D$21='Interactive Worksheet'!$M$13,Navy!R90,))))))","v":{"$error":"#N/A"}},{"$f":"IF(D145<>0,D145*'Components and Space Standards'!C95,IF($D$21=$M$9,Navy!H90,IF($D$21=$M$10,Navy!K90,IF($D$21='Interactive Worksheet'!$M$11,Navy!N90,IF($D$21='Interactive Worksheet'!$M$12,Navy!Q90,IF($D$21='Interactive Worksheet'!$M$13,Navy!T90,))))))","v":{"$error":"#N/A"}},{"$f":"IF(D145<>0,D145,IF($D$21=$M$10,AF!F88,IF($D$21=$M$11,AF!I88,IF($D$21='Interactive Worksheet'!$M$12,AF!L88,))))","v":{"$error":"#N/A"}},{"$f":"IF(D145<>0,D145*'Components and Space Standards'!C95,IF($D$21=$M$10,AF!H88,IF($D$21=$M$11,AF!K88,IF($D$21='Interactive Worksheet'!$M$12,AF!N88,))))","v":{"$error":"#N/A"}},{"$f":"IF($D145<>0,$D145,IF($D$21=$M$9,MC!F90,IF($D$21=$M$10,MC!I90,IF($D$21='Interactive Worksheet'!$M$11,MC!L90,IF($D$21='Interactive Worksheet'!$M$12,MC!O90,IF($D$21='Interactive Worksheet'!$M$13,MC!R90,))))))","v":{"$error":"#N/A"}},{"$f":"IF($D145<>0,$D145*'Components and Space Standards'!C95,IF($D$21=$M$9,MC!H90,IF($D$21=$M$10,MC!K90,IF($D$21='Interactive Worksheet'!$M$11,MC!N90,IF($D$21='Interactive Worksheet'!$M$12,MC!Q90,IF($D$21='Interactive Worksheet'!$M$13,MC!T90,))))))","v":{"$error":"#N/A"}}]
[]
[null,null,null,null,"Subtotal - Total Net Building Area",null,{"$f":"H147*$K$33","v":0},{"$f":"SUM(H34:H146)","v":0}]
[null,null,null,null,null,null,null,null,null,null,0.25]
[null,null,"*Use default or select from range:",null,{"$f":"IF(D149=0,\"Net-to-Gross factor at \"&K150,\"Net-to-Gross factor at \"&D149)","v":"Net-to-Gross factor at 0.27"},null,{"$f":"G147*$K$149","v":0},{"$f":"IF($D$149=0,0.27*H147,H147*$D$149)","v":0},null,{"$f":"IF(D149<>0,\"D\",)","v":0},0.26,null,null,null,null,null,null,null,null,null,null,null,"Multiplier is 27%, unless changed in dropdown selection"]
[null,null,"*Use at least 28% if Fitness Center is more than 1 story",null,null,null,null,null,null,null,0.27]
[null,null,null,null,"TOTAL GROSS BUILDING",null,{"$f":"G149+G147","v":0},{"$f":"H149+H147","v":0},null,null,0.28000000000000003]
[null,null,null,null,null,null,null,null,null,null,0.28999999999999998,null,null,null,{"$f":"IF(D152<>0,D152,IF($D$21=$M$9,Navy!F97,IF($D$21=$M$10,Navy!I97,IF($D$21='Interactive Worksheet'!$M$11,Navy!L97,IF($D$21='Interactive Worksheet'!$M$12,Navy!O97,IF($D$21='Interactive Worksheet'!$M$13,Navy!R97,))))))","v":{"$error":"#N/A"}},{"$f":"IF(D152<>0,D152*'Components and Space Standards'!C102,IF($D$21=$M$9,Navy!H97,IF($D$21=$M$10,Navy!K97,IF($D$21='Interactive Worksheet'!$M$11,Navy!N97,IF($D$21='Interactive Worksheet'!$M$12,Navy!Q97,IF($D$21='Interactive Worksheet'!$M$13,Navy!T97,))))))","v":{"$error":"#N/A"}},{"$f":"IF(D152<>0,D152,IF($D$21=$M$10,AF!F95,IF($D$21=$M$11,AF!I95,IF($D$21='Interactive Worksheet'!$M$12,AF!L95,))))","v":{"$error":"#N/A"}},{"$f":"IF(D152<>0,D152*'Components and Space Standards'!C102,IF($D$21=$M$10,AF!H95,IF($D$21=$M$11,AF!K95,IF($D$21='Interactive Worksheet'!$M$12,AF!N95,))))","v":{"$error":"#N/A"}},{"$f":"IF($D152<>0,$D152,IF($D$21=$M$9,MC!F97,IF($D$21=$M$10,MC!I97,IF($D$21='Interactive Worksheet'!$M$11,MC!L97,IF($D$21='Interactive Worksheet'!$M$12,MC!O97,IF($D$21='Interactive Worksheet'!$M$13,MC!R97,))))))","v":{"$error":"#N/A"}},{"$f":"IF($D152<>0,$D152*'Components and Space Standards'!C102,IF($D$21=$M$9,MC!H97,IF($D$21=$M$10,MC!K97,IF($D$21='Interactive Worksheet'!$M$11,MC!N97,IF($D$21='Interactive Worksheet'!$M$12,MC!Q97,IF($D$21='Interactive Worksheet'!$M$13,MC!T97,))))))","v":{"$error":"#N/A"}}]
[{"$f":"IF(OR($D$26<>\"Yes\",$D$26=0,$K$26<>\"Yes\"),,'Components and Space Standards'!A94)","v":0},null,null,null,"Default quantities",null," m2","ft.2",null,null,0.3,null,null,null,{"$f":"IF(D153<>0,D153,IF($D$21=$M$9,Navy!F98,IF($D$21=$M$10,Navy!I98,IF($D$21='Interactive Worksheet'!$M$11,Navy!L98,IF($D$21='Interactive Worksheet'!$M$12,Navy!O98,IF($D$21='Interactive Worksheet'!$M$13,Navy!R98,))))))","v":{"$error":"#N/A"}},{"$f":"IF(D153<>0,D153*'Components and Space Standards'!C103,IF($D$21=$M$9,Navy!H98,IF($D$21=$M$10,Navy!K98,IF($D$21='Interactive Worksheet'!$M$11,Navy!N98,IF($D$21='Interactive Worksheet'!$M$12,Navy!Q98,IF($D$21='Interactive Worksheet'!$M$13,Navy!T98,))))))","v":{"$error":"#N/A"}},{"$f":"IF(D153<>0,D153,IF($D$21=$M$10,AF!F96,IF($D$21=$M$11,AF!I96,IF($D$21='Interactive Worksheet'!$M$12,AF!L96,))))","v":{"$error":"#N/A"}},{"$f":"IF(D153<>0,D153*'Components and Space Standards'!C103,IF($D$21=$M$10,AF!H96,IF($D$21=$M$11,AF!K96,IF($D$21='Interactive Worksheet'!$M$12,AF!N96,))))","v":{"$error":"#N/A"}},{"$f":"IF($D153<>0,$D153,IF($D$21=$M$9,MC!F98,IF($D$21=$M$10,MC!I98,IF($D$21='Interactive Worksheet'!$M$11,MC!L98,IF($D$21='Interactive Worksheet'!$M$12,MC!O98,IF($D$21='Interactive Worksheet'!$M$13,MC!R98,))))))","v":{"$error":"#N/A"}},{"$f":"IF($D153<>0,$D153*'Components and Space Standards'!C103,IF($D$21=$M$9,MC!H98,IF($D$21=$M$10,MC!K98,IF($D$21='Interactive Worksheet'!$M$11,MC!N98,IF($D$21='Interactive Worksheet'!$M$12,MC!Q98,IF($D$21='Interactive Worksheet'!$M$13,MC!T98,))))))","v":{"$error":"#N/A"}}]
[{"$f":"IF(OR($D$26<>\"Yes\",$D$26=0,$K$26<>\"Yes\"),,'Components and Space Standards'!A95)","v":0},null,null,null,{"$f":"IF(OR($D$26<>\"Yes\",$D$26=0,$K$26<>\"Yes\"),,IF($D$5=$K$5,$M154&\" \"&'Components and Space Standards'!$D95&\".\",IF($D$5=$K$6,$O154&\" \"&'Components and Space Standards'!$D95&\".\",IF($D$5=$K$7,$Q154&\" \"&'Components and Space Standards'!$D95&\".\",IF($D$5=$K$8,$S154&\" \"&'Components and Space Standards'!$D95&\".\",)))))","v":0},null,{"$f":"ROUND(H154*$K$33,2)","v":0},{"$f":"IF(OR($D$26<>\"Yes\",$D$26=0,$K$26<>\"Yes\"),,IF($D$5=$K$5,N154,IF($D$5=$K$6,P154,IF($D$5=$K$7,R154,IF($D$5=$K$8,T154,)))))","v":0},null,null,null,null,{"$f":"IF($D154<>0,$D154,IF($D$21=$M$9,Army!$F89,IF($D$21=$M$10,Army!$I89,IF($D$21='Interactive Worksheet'!$M$11,Army!$L89,IF($D$21='Interactive Worksheet'!$M$12,Army!$O89,IF($D$21='Interactive Worksheet'!$M$13,IF($M$17=0,Army!$R89,($M$17*Army!U89)+Army!R89)))))))","v":{"$error":"#N/A"}},{"$f":"IF($D154<>0,$D154*'Components and Space Standards'!$C95,IF($D$21=$M$9,Army!$H89,IF($D$21=$M$10,Army!$K89,IF($D$21='Interactive Worksheet'!$M$11,Army!$N89,IF($D$21='Interactive Worksheet'!$M$12,Army!$Q89,IF($D$21='Interactive Worksheet'!$M$13,IF($M$17=0,Army!$T89,($M$17*Army!W89)+Army!T89)))))))","v":{"$error":"#N/A"}},{"$f":"IF(D154<>0,D154,IF($D$21=$M$9,Navy!F90,IF($D$21=$M$10,Navy!I90,IF($D$21='Interactive Worksheet'!$M$11,Navy!L90,IF($D$21='Interactive Worksheet'!$M$12,Navy!O90,IF($D$21='Interactive Worksheet'!$M$13,Navy!R90,IF($O$18>0,Navy!U90,)))))))","v":{"$error":"#N/A"}},{"$f":"IF(D154<>0,D154*'Components and Space Standards'!C95,IF($D$21=$M$9,Navy!H90,IF($D$21=$M$10,Navy!K90,IF($D$21='Interactive Worksheet'!$M$11,Navy!N90,IF($D$21='Interactive Worksheet'!$M$12,Navy!Q90,IF($D$21='Interactive Worksheet'!$M$13,Navy!T90,IF($O$18>0,Navy!W90,)))))))","v":{"$error":"#N/A"}},null,null,{"$f":"IF($D154<>0,$D154,IF($D$21=$M$9,MC!F90,IF($D$21=$M$10,MC!I90,IF($D$21='Interactive Worksheet'!$M$11,MC!L90,IF($D$21='Interactive Worksheet'!$M$12,MC!O90,IF($D$21='Interactive Worksheet'!$M$13,MC!R90,))))))","v":{"$error":"#N/A"}},{"$f":"IF($D154<>0,$D154*'Components and Space Standards'!C95,IF($D$21=$M$9,MC!H90,IF($D$21=$M$10,MC!K90,IF($D$21='Interactive Worksheet'!$M$11,MC!N90,IF($D$21='Interactive Worksheet'!$M$12,MC!Q90,IF($D$21='Interactive Worksheet'!$M$13,MC!T90,))))))","v":{"$error":"#N/A"}}]
[{"$f":"IF(OR($D$26<>\"Yes\",$D$26=0,$K$26<>\"Yes\"),,'Components and Space Standards'!A96)","v":0},null,{"$f":"IF(OR($D$26<>\"Yes\",$D$26=0,$K$26<>\"Yes\"),,\"For this option, select yes or no:\")","v":0},null,{"$f":"IF(OR($D$26<>\"Yes\",$D$26=0,$K$26<>\"Yes\"),,IF($D$5=$K$5,$M155&\" \"&'Components and Space Standards'!$D96&\".\",IF($D$5=$K$6,$O155&\" \"&'Components and Space Standards'!$D96&\".\",IF($D$5=$K$7,$Q155&\" \"&'Components and Space Standards'!$D96&\".\",IF($D$5=$K$8,$S155&\" \"&'Components and Space Standards'!$D96&\".\",)))))","v":0},null,0,0,null,{"$f":"IF(D155<>0,\"D\",)","v":0},"see K121 for select boxes",null,{"$f":"IF($D$21=$M$9,Army!$F90,IF($D$21=$M$10,Army!$I90,IF($D$21='Interactive Worksheet'!$M$11,Army!$L90,IF($D$21='Interactive Worksheet'!$M$12,Army!$O90,IF($D$21='Interactive Worksheet'!$M$13,IF($M$17=0,Army!$R90,($M$17*Army!U90)+Army!R90))))))","v":{"$error":"#N/A"}},{"$f":"IF($D$21=$M$9,Army!$H90,IF($D$21=$M$10,Army!$K90,IF($D$21='Interactive Worksheet'!$M$11,Army!$N90,IF($D$21='Interactive Worksheet'!$M$12,Army!$Q90,IF($D$21='Interactive Worksheet'!$M$13,IF($M$17=0,Army!$T90,($M$17*Army!W90)+Army!T90))))))","v":{"$error":"#N/A"}},{"$f":"IF($D$21=$M$9,Navy!F91,IF($D$21=$M$10,Navy!I91,IF($D$21='Interactive Worksheet'!$M$11,Navy!L91,IF($D$21='Interactive Worksheet'!$M$12,Navy!O91,IF($D$21='Interactive Worksheet'!$M$13,Navy!R91,IF($O$18>0,Navy!U91,))))))","v":{"$error":"#N/A"}},{"$f":"IF($D$21=$M$9,Navy!H91,IF($D$21=$M$10,Navy!K91,IF($D$21='Interactive Worksheet'!$M$11,Navy!N91,IF($D$21='Interactive Worksheet'!$M$12,Navy!Q91,IF($D$21='Interactive Worksheet'!$M$13,Navy!T91,IF($O$18>0,Navy!W91,))))))","v":{"$error":"#N/A"}},null,null,{"$f":"IF($D155=\"Yes\",1,)","v":0},{"$f":"IF($D155=\"Yes\",1*'Components and Space Standards'!C96,IF($D$21=$M$9,MC!H100,IF($D$21=$M$10,MC!K100,IF($D$21='Interactive Worksheet'!$M$11,MC!N100,IF($D$21='Interactive Worksheet'!$M$12,MC!Q100,IF($D$21='Interactive Worksheet'!$M$13,MC!T100,))))))","v":{"$error":"#N/A"}}]
[{"$f":"IF(OR($D$26<>\"Yes\",$D$26=0,$K$26<>\"Yes\"),,'Components and Space Standards'!A97)","v":0},null,null,null,{"$f":"IF(OR($D$26<>\"Yes\",$D$26=0,$K$26<>\"Yes\"),,IF($D$5=$K$5,$M156&\" \"&'Components and Space Standards'!$D97&\".\",IF($D$5=$K$6,$O156&\" \"&'Components and Space Standards'!$D97&\".\",IF($D$5=$K$7,$Q156&\" \"&'Components and Space Standards'!$D97&\".\",IF($D$5=$K$8,$S156&\" \"&'Components and Space Standards'!$D97&\".\",)))))","v":0},null,0,0,null,null,null,null,{"$f":"IF($D156<>0,$D156,IF($D$21=$M$9,Army!$F91,IF($D$21=$M$10,Army!$I91,IF($D$21='Interactive Worksheet'!$M$11,Army!$L91,IF($D$21='Interactive Worksheet'!$M$12,Army!$O91,IF($D$21='Interactive Worksheet'!$M$13,IF($M$17=0,Army!$R91,($M$17*Army!U91)+Army!R91)))))))","v":{"$error":"#N/A"}},{"$f":"IF($D156<>0,$D156*'Components and Space Standards'!$C97,IF($D$21=$M$9,Army!$H91,IF($D$21=$M$10,Army!$K91,IF($D$21='Interactive Worksheet'!$M$11,Army!$N91,IF($D$21='Interactive Worksheet'!$M$12,Army!$Q91,IF($D$21='Interactive Worksheet'!$M$13,IF($M$17=0,Army!$T91,($M$17*Army!W91)+Army!T91)))))))","v":{"$error":"#N/A"}},{"$f":"IF(D156<>0,D156,IF($D$21=$M$9,Navy!F92,IF($D$21=$M$10,Navy!I92,IF($D$21='Interactive Worksheet'!$M$11,Navy!L92,IF($D$21='Interactive Worksheet'!$M$12,Navy!O92,IF($D$21='Interactive Worksheet'!$M$13,Navy!R92,IF($O$18>0,Navy!U92,)))))))","v":{"$error":"#N/A"}},{"$f":"IF(D156<>0,D156*'Components and Space Standards'!C97,IF($D$21=$M$9,Navy!H92,IF($D$21=$M$10,Navy!K92,IF($D$21='Interactive Worksheet'!$M$11,Navy!N92,IF($D$21='Interactive Worksheet'!$M$12,Navy!Q92,IF($D$21='Interactive Worksheet'!$M$13,Navy!T92,IF($O$18>0,Navy!W92,)))))))","v":{"$error":"#N/A"}},null,null,{"$f":"IF($D156<>0,$D156,IF($D$21=$M$9,MC!F92,IF($D$21=$M$10,MC!I92,IF($D$21='Interactive Worksheet'!$M$11,MC!L92,IF($D$21='Interactive Worksheet'!$M$12,MC!O92,IF($D$21='Interactive Worksheet'!$M$13,MC!R92,))))))","v":{"$error":"#N/A"}},{"$f":"IF($D156<>0,$D156*'Components and Space Standards'!C97,IF($D$21=$M$9,MC!H92,IF($D$21=$M$10,MC!K92,IF($D$21='Interactive Worksheet'!$M$11,MC!N92,IF($D$21='Interactive Worksheet'!$M$12,MC!Q92,IF($D$21='Interactive Worksheet'!$M$13,MC!T92,))))))","v":{"$error":"#N/A"}}]
[{"$f":"IF(OR($D$26<>\"Yes\",$D$26=0,$K$26<>\"Yes\"),,'Components and Space Standards'!A98)","v":0},null,null,null,{"$f":"IF(OR($D$26<>\"Yes\",$D$26=0,$K$26<>\"Yes\"),,IF($D$5=$K$5,$M157&\" \"&'Components and Space Standards'!$D98&\".\",IF($D$5=$K$6,$O157&\" \"&'Components and Space Standards'!$D98&\".\",IF($D$5=$K$7,$Q157&\" \"&'Components and Space Standards'!$D98&\".\",IF($D$5=$K$8,$S157&\" \"&'Components and Space Standards'!$D98&\".\",)))))","v":0},null,0,0,null,null,null,null,{"$f":"IF($D157<>0,$D157,IF($D$21=$M$9,Army!$F92,IF($D$21=$M$10,Army!$I92,IF($D$21='Interactive Worksheet'!$M$11,Army!$L92,IF($D$21='Interactive Worksheet'!$M$12,Army!$O92,IF($D$21='Interactive Worksheet'!$M$13,IF($M$17=0,Army!$R92,($M$17*Army!U92)+Army!R92)))))))","v":{"$error":"#N/A"}},{"$f":"IF($D157<>0,$D157*'Components and Space Standards'!$C98,IF($D$21=$M$9,Army!$H92,IF($D$21=$M$10,Army!$K92,IF($D$21='Interactive Worksheet'!$M$11,Army!$N92,IF($D$21='Interactive Worksheet'!$M$12,Army!$Q92,IF($D$21='Interactive Worksheet'!$M$13,IF($M$17=0,Army!$T92,($M$17*Army!W92)+Army!T92)))))))","v":{"$error":"#N/A"}},{"$f":"IF(D157<>0,D157,IF($D$21=$M$9,Navy!F93,IF($D$21=$M$10,Navy!I93,IF($D$21='Interactive Worksheet'!$M$11,Navy!L93,IF($D$21='Interactive Worksheet'!$M$12,Navy!O93,IF($D$21='Interactive Worksheet'!$M$13,Navy!R93,IF($O$18>0,Navy!U93,)))))))","v":{"$error":"#N/A"}},{"$f":"IF(D157<>0,D157*'Components and Space Standards'!C98,IF($D$21=$M$9,Navy!H93,IF($D$21=$M$10,Navy!K93,IF($D$21='Interactive Worksheet'!$M$11,Navy!N93,IF($D$21='Interactive Worksheet'!$M$12,Navy!Q93,IF($D$21='Interactive Worksheet'!$M$13,Navy!T93,IF($O$18>0,Navy!W93,)))))))","v":{"$error":"#N/A"}},null,null,{"$f":"IF($D157<>0,$D157,IF($D$21=$M$9,MC!F93,IF($D$21=$M$10,MC!I93,IF($D$21='Interactive Worksheet'!$M$11,MC!L93,IF($D$21='Interactive Worksheet'!$M$12,MC!O93,IF($D$21='Interactive Worksheet'!$M$13,MC!R93,))))))","v":{"$error":"#N/A"}},{"$f":"IF($D157<>0,$D157*'Components and Space Standards'!C98,IF($D$21=$M$9,MC!H93,IF($D$21=$M$10,MC!K93,IF($D$21='Interactive Worksheet'!$M$11,MC!N93,IF($D$21='Interactive Worksheet'!$M$12,MC!Q93,IF($D$21='Interactive Worksheet'!$M$13,MC!T93,))))))","v":{"$error":"#N/A"}}]
[{"$f":"IF(OR($D$26<>\"Yes\",$D$26=0,$K$26<>\"Yes\"),,'Components and Space Standards'!A99)","v":0},null,null,null,{"$f":"IF(OR($D$26<>\"Yes\",$D$26=0,$K$26<>\"Yes\"),,IF($D$5=$K$5,$M158&\" \"&'Components and Space Standards'!$D99&\".\",IF($D$5=$K$6,$O158&\" \"&'Components and Space Standards'!$D99&\".\",IF($D$5=$K$7,$Q158&\" \"&'Components and Space Standards'!$D99&\".\",IF($D$5=$K$8,$S158&\" \"&'Components and Space Standards'!$D99&\".\",)))))","v":0},null,0,0,null,null,null,null,{"$f":"IF($D158<>0,$D158,IF($D$21=$M$9,Army!$F93,IF($D$21=$M$10,Army!$I93,IF($D$21='Interactive Worksheet'!$M$11,Army!$L93,IF($D$21='Interactive Worksheet'!$M$12,Army!$O93,IF($D$21='Interactive Worksheet'!$M$13,IF($M$17=0,Army!$R93,($M$17*Army!U93)+Army!R93)))))))","v":{"$error":"#N/A"}},{"$f":"IF($D158<>0,$D158*'Components and Space Standards'!$C99,IF($D$21=$M$9,Army!$H93,IF($D$21=$M$10,Army!$K93,IF($D$21='Interactive Worksheet'!$M$11,Army!$N93,IF($D$21='Interactive Worksheet'!$M$12,Army!$Q93,IF($D$21='Interactive Worksheet'!$M$13,IF($M$17=0,Army!$T93,($M$17*Army!W93)+Army!T93)))))))","v":{"$error":"#N/A"}},{"$f":"IF(D158<>0,D158,IF($D$21=$M$9,Navy!F94,IF($D$21=$M$10,Navy!I94,IF($D$21='Interactive Worksheet'!$M$11,Navy!L94,IF($D$21='Interactive Worksheet'!$M$12,Navy!O94,IF($D$21='Interactive Worksheet'!$M$13,Navy!R94,IF($O$18>0,Navy!U94,)))))))","v":{"$error":"#N/A"}},{"$f":"IF(D158<>0,D158*'Components and Space Standards'!C99,IF($D$21=$M$9,Navy!H94,IF($D$21=$M$10,Navy!K94,IF($D$21='Interactive Worksheet'!$M$11,Navy!N94,IF($D$21='Interactive Worksheet'!$M$12,Navy!Q94,IF($D$21='Interactive Worksheet'!$M$13,Navy!T94,IF($O$18>0,Navy!W94,)))))))","v":{"$error":"#N/A"}},null,null,{"$f":"IF($D158<>0,$D158,IF($D$21=$M$9,MC!F94,IF($D$21=$M$10,MC!I94,IF($D$21='Interactive Worksheet'!$M$11,MC!L94,IF($D$21='Interactive Worksheet'!$M$12,MC!O94,IF($D$21='Interactive Worksheet'!$M$13,MC!R94,))))))","v":{"$error":"#N/A"}},{"$f":"IF($D158<>0,$D158*'Components and Space Standards'!C99,IF($D$21=$M$9,MC!H94,IF($D$21=$M$10,MC!K94,IF($D$21='Interactive Worksheet'!$M$11,MC!N94,IF($D$21='Interactive Worksheet'!$M$12,MC!Q94,IF($D$21='Interactive Worksheet'!$M$13,MC!T94,))))))","v":{"$error":"#N/A"}}]
[{"$f":"IF(OR($D$26<>\"Yes\",$D$26=0,$K$26<>\"Yes\"),,'Components and Space Standards'!A100)","v":0},null,{"$f":"IF(OR($D$26<>\"Yes\",$D$26=0,$K$26<>\"Yes\"),,\"For this option, select yes or no:\")","v":0},null,{"$f":"IF(OR($D$26<>\"Yes\",$D$26=0,$K$26<>\"Yes\"),,IF($D$5=$K$5,$M159&\" \"&'Components and Space Standards'!$D100&\".\",IF($D$5=$K$6,$O159&\" \"&'Components and Space Standards'!$D100&\".\",IF($D$5=$K$7,$Q159&\" \"&'Components and Space Standards'!$D100&\".\",IF($D$5=$K$8,$S159&\" \"&'Components and Space Standards'!$D100&\".\",)))))","v":0},null,0,0,null,{"$f":"IF(D159<>0,\"D\",)","v":0},null,null,{"$f":"IF($D$21=$M$9,Army!$F94,IF($D$21=$M$10,Army!$I94,IF($D$21='Interactive Worksheet'!$M$11,Army!$L94,IF($D$21='Interactive Worksheet'!$M$12,Army!$O94,IF($D$21='Interactive Worksheet'!$M$13,IF($M$17=0,Army!$R94,($M$17*Army!U94)+Army!R94))))))","v":{"$error":"#N/A"}},{"$f":"IF($D$21=$M$9,Army!$H94,IF($D$21=$M$10,Army!$K94,IF($D$21='Interactive Worksheet'!$M$11,Army!$N94,IF($D$21='Interactive Worksheet'!$M$12,Army!$Q94,IF($D$21='Interactive Worksheet'!$M$13,IF($M$17=0,Army!$T94,($M$17*Army!W94)+Army!T94))))))","v":{"$error":"#N/A"}},{"$f":"IF($D$21=$M$9,Navy!F95,IF($D$21=$M$10,Navy!I95,IF($D$21='Interactive Worksheet'!$M$11,Navy!L95,IF($D$21='Interactive Worksheet'!$M$12,Navy!O95,IF($D$21='Interactive Worksheet'!$M$13,Navy!R95,IF($O$18>0,Navy!U95,))))))","v":{"$error":"#N/A"}},{"$f":"IF($D$21=$M$9,Navy!H95,IF($D$21=$M$10,Navy!K95,IF($D$21='Interactive Worksheet'!$M$11,Navy!N95,IF($D$21='Interactive Worksheet'!$M$12,Navy!Q95,IF($D$21='Interactive Worksheet'!$M$13,Navy!T95,IF($O$18>0,Navy!W95,))))))","v":{"$error":"#N/A"}},null,null,{"$f":"IF($D159=\"Yes\",20,)","v":0},{"$f":"IF($D159=\"Yes\",20*'Components and Space Standards'!C100,IF($D$21=$M$9,MC!H104,IF($D$21=$M$10,MC!K104,IF($D$21='Interactive Worksheet'!$M$11,MC!N104,IF($D$21='Interactive Worksheet'!$M$12,MC!Q104,IF($D$21='Interactive Worksheet'!$M$13,MC!T104,))))))","v":{"$error":"#N/A"}}]
[]
[null,null,null,null,"TOTAL GROSS SITE SUPPORT",null,{"$f":"SUM(G154:G159)","v":0},{"$f":"SUM(H154:H159)","v":0}]
[]
[]
[null,null,null,null,"TOTAL GROSS FACILITY (BUILDING + SITE SUPPORT)",null,{"$f":"G161+G151","v":0},{"$f":"H161+H151","v":0}]